BDBM396 3-[(4-amino-2-tert-butyl-5-methylphenyl)sulfanyl]-4-hydroxy-6-[2-(4-hydroxyphenyl)ethyl]-6-(propan-2-yl)-5,6-dihydro-2H-pyran-2-one::CHEMBL38268::Dihydropyran-2-one deriv. 1
SMILES: CC(C)C1(CCc2ccc(O)cc2)CC(=O)C(Sc2cc(C)c(N)cc2C(C)(C)C)C(=O)O1
InChI Key: InChIKey=HPYCGBSIYDCTOZ-UHFFFAOYSA-N
Data: 3 KI  3 IC50
PDB links: 1 PDB ID contains this monomer as substructures. 1 PDB ID contains inhibitors having a similarity of 90% to this monomer.
Activity Spreadsheet -- Enzyme Inhibition Constant Data from BindingDB
Found 5 hits for monomerid = 396
Trg + Lig
Ki
nM
ΔG°
kcal/mole
IC50
nM
Kd
nM
EC50/IC50
nM
koff
s-1
kon
M-1s-1
pHTemp
°C
HIV-1 Protease
(Human immunodeficiency virus type 1)
BDBM396
(3-[(4-amino-2-tert-butyl-5-methylphenyl)sulfanyl]-...)
Show SMILES CC(C)C1(CCc2ccc(O)cc2)CC(=O)C(Sc2cc(C)c(N)cc2C(C)(C)C)C(=O)O1
Show InChI InChI=1S/C27H35NO4S/c1-16(2)27(12-11-18-7-9-19(29)10-8-18)15-22(30)24(25(31)32-27)33-23-13-17(3)21(28)14-20(23)26(4,5)6/h7-10,13-14,16,24,29H,11-12,15,28H2,1-6H3
0.670 -13.0 2.70n/an/an/an/a6.237
Parke-Davis Pharmaceutical Research
Assay Description
Sensitivity of HIV-1 protease activity to protease inhibitors was determined by a peptide substrate cleavage assay. Protease products were analyzed o...
J Med Chem 43: 843-58 (2000)
Article DOI: 10.1021/jm990281p
BindingDB Entry DOI: 10.7270/Q21N7Z9R
Human immunodeficiency virus type 1 protease
(Human immunodeficiency virus type 1)
BDBM396
(3-[(4-amino-2-tert-butyl-5-methylphenyl)sulfanyl]-...)
Show SMILES CC(C)C1(CCc2ccc(O)cc2)CC(=O)C(Sc2cc(C)c(N)cc2C(C)(C)C)C(=O)O1
Show InChI InChI=1S/C27H35NO4S/c1-16(2)27(12-11-18-7-9-19(29)10-8-18)15-22(30)24(25(31)32-27)33-23-13-17(3)21(28)14-20(23)26(4,5)6/h7-10,13-14,16,24,29H,11-12,15,28H2,1-6H3
0.670n/an/an/an/an/an/a6.2n/a
Warner-Lambert Company
Curated by ChEMBL
Assay Description
Binding affinity of the compound towards HIV protease was determined
Bioorg Med Chem Lett 9: 1481-6 (1999)
BindingDB Entry DOI: 10.7270/Q2668CC2
Human immunodeficiency virus type 1 protease
(Human immunodeficiency virus type 1)
BDBM396
(3-[(4-amino-2-tert-butyl-5-methylphenyl)sulfanyl]-...)
Show SMILES CC(C)C1(CCc2ccc(O)cc2)CC(=O)C(Sc2cc(C)c(N)cc2C(C)(C)C)C(=O)O1
Show InChI InChI=1S/C27H35NO4S/c1-16(2)27(12-11-18-7-9-19(29)10-8-18)15-22(30)24(25(31)32-27)33-23-13-17(3)21(28)14-20(23)26(4,5)6/h7-10,13-14,16,24,29H,11-12,15,28H2,1-6H3
0.670n/an/an/an/an/an/an/an/a
Parke-Davis Pharmaceutical Research
Assay Description
Tested for binding affinity against HIV protease
J Med Chem 43: 843-58 (2000)
Article DOI: 10.1021/jm990281p
BindingDB Entry DOI: 10.7270/Q21N7Z9R
Human immunodeficiency virus type 1 protease
(Human immunodeficiency virus type 1)
BDBM396
(3-[(4-amino-2-tert-butyl-5-methylphenyl)sulfanyl]-...)
Show SMILES CC(C)C1(CCc2ccc(O)cc2)CC(=O)C(Sc2cc(C)c(N)cc2C(C)(C)C)C(=O)O1
Show InChI InChI=1S/C27H35NO4S/c1-16(2)27(12-11-18-7-9-19(29)10-8-18)15-22(30)24(25(31)32-27)33-23-13-17(3)21(28)14-20(23)26(4,5)6/h7-10,13-14,16,24,29H,11-12,15,28H2,1-6H3
n/an/a 2.70n/an/an/an/an/an/a
Parke-Davis Pharmaceutical Research
Assay Description
Activity of potent nonpeptidic inhibitor against protease
J Med Chem 43: 843-58 (2000)
Article DOI: 10.1021/jm990281p
BindingDB Entry DOI: 10.7270/Q21N7Z9R
Human immunodeficiency virus type 1 protease
(Human immunodeficiency virus type 1)
BDBM396
(3-[(4-amino-2-tert-butyl-5-methylphenyl)sulfanyl]-...)
Show SMILES CC(C)C1(CCc2ccc(O)cc2)CC(=O)C(Sc2cc(C)c(N)cc2C(C)(C)C)C(=O)O1
Show InChI InChI=1S/C27H35NO4S/c1-16(2)27(12-11-18-7-9-19(29)10-8-18)15-22(30)24(25(31)32-27)33-23-13-17(3)21(28)14-20(23)26(4,5)6/h7-10,13-14,16,24,29H,11-12,15,28H2,1-6H3
n/an/a 2.70n/an/an/an/a6.2n/a
Warner-Lambert Company
Curated by ChEMBL
Assay Description
In vitro binding affinity against HIV protease at pH 6.2.
Bioorg Med Chem Lett 9: 1481-6 (1999)
BindingDB Entry DOI: 10.7270/Q2668CC2