BDBM39735 MLS000566764::N-(diphenylmethyl)-2-[methyl-[(4-oxidanylidene-1H-quinazolin-2-yl)methyl]amino]ethanamide::N-(diphenylmethyl)-2-[methyl-[(4-oxo-1H-quinazolin-2-yl)methyl]amino]acetamide::N-benzhydryl-2-[(4-keto-1H-quinazolin-2-yl)methyl-methyl-amino]acetamide::N-benzhydryl-2-[methyl-[(4-oxo-1H-quinazolin-2-yl)methyl]amino]acetamide::SMR000153739::cid_2439531
SMILES: CN(CC(=O)NC(c1ccccc1)c1ccccc1)Cc1nc2ccccc2c(=O)[nH]1
InChI Key: InChIKey=IEMQWGJKYNVGQR-UHFFFAOYSA-N
Data: 5 IC50  1 EC50
Activity Spreadsheet -- Enzyme Inhibition Constant Data from BindingDB
Found 6 hits for monomerid = 39735
Trg + Lig
Ki
nM
ΔG°
kcal/mole
IC50
nM
Kd
nM
EC50/IC50
nM
koff
s-1
kon
M-1s-1
pHTemp
°C
Alkaline phosphatase placental-like
(Homo sapiens (Human))
BDBM39735
(MLS000566764 | N-(diphenylmethyl)-2-[methyl-[(4-ox...)
Show SMILES CN(CC(=O)NC(c1ccccc1)c1ccccc1)Cc1nc2ccccc2c(=O)[nH]1
Show InChI InChI=1S/C25H24N4O2/c1-29(16-22-26-21-15-9-8-14-20(21)25(31)27-22)17-23(30)28-24(18-10-4-2-5-11-18)19-12-6-3-7-13-19/h2-15,24H,16-17H2,1H3,(H,28,30)(H,26,27,31)
PCBioAssay
n/an/a 9.99E+5n/an/an/an/an/an/a
Burnham Center for Chemical Genomics
Curated by PubChem BioAssay
Assay Description
Sanford-Burnham Center for Chemical Genomics (SBCCG) Sanford-Burnham Medical Research Institute (SBMRI, San Diego, CA) NIH Molecular Libraries Screen...
PubChem Bioassay (2007)
BindingDB Entry DOI: 10.7270/Q2MS3R5M
Alkaline phosphatase placental-like
(Homo sapiens (Human))
BDBM39735
(MLS000566764 | N-(diphenylmethyl)-2-[methyl-[(4-ox...)
Show SMILES CN(CC(=O)NC(c1ccccc1)c1ccccc1)Cc1nc2ccccc2c(=O)[nH]1
Show InChI InChI=1S/C25H24N4O2/c1-29(16-22-26-21-15-9-8-14-20(21)25(31)27-22)17-23(30)28-24(18-10-4-2-5-11-18)19-12-6-3-7-13-19/h2-15,24H,16-17H2,1H3,(H,28,30)(H,26,27,31)
PCBioAssay
n/an/an/an/a 9.99E+5n/an/an/an/a
Burnham Center for Chemical Genomics
Curated by PubChem BioAssay
Assay Description
Sanford-Burnham Center for Chemical Genomics (SBCCG) Sanford-Burnham Medical Research Institute (SBMRI, San Diego, CA) NIH Molecular Libraries Screen...
PubChem Bioassay (2007)
BindingDB Entry DOI: 10.7270/Q2RV0M49
Alpi
(Rattus norvegicus (Rat))
BDBM39735
(MLS000566764 | N-(diphenylmethyl)-2-[methyl-[(4-ox...)
Show SMILES CN(CC(=O)NC(c1ccccc1)c1ccccc1)Cc1nc2ccccc2c(=O)[nH]1
Show InChI InChI=1S/C25H24N4O2/c1-29(16-22-26-21-15-9-8-14-20(21)25(31)27-22)17-23(30)28-24(18-10-4-2-5-11-18)19-12-6-3-7-13-19/h2-15,24H,16-17H2,1H3,(H,28,30)(H,26,27,31)
PCBioAssay
n/an/a 7.93E+3n/an/an/an/an/an/a
Burnham Center for Chemical Genomics
Curated by PubChem BioAssay
Assay Description
Data Source: Sanford-Burnham Center for Chemical Genomics (SBCCG) Source Affiliation: Sanford-Burnham Medical Research Institute (SBMRI, San Diego, C...
PubChem Bioassay (2010)
BindingDB Entry DOI: 10.7270/Q2DB809V
Alkaline phosphatase placental-like
(Homo sapiens (Human))
BDBM39735
(MLS000566764 | N-(diphenylmethyl)-2-[methyl-[(4-ox...)
Show SMILES CN(CC(=O)NC(c1ccccc1)c1ccccc1)Cc1nc2ccccc2c(=O)[nH]1
Show InChI InChI=1S/C25H24N4O2/c1-29(16-22-26-21-15-9-8-14-20(21)25(31)27-22)17-23(30)28-24(18-10-4-2-5-11-18)19-12-6-3-7-13-19/h2-15,24H,16-17H2,1H3,(H,28,30)(H,26,27,31)
PCBioAssay
n/an/a>1.00E+5n/an/an/an/an/an/a
Burnham Center for Chemical Genomics
Curated by PubChem BioAssay
Assay Description
Data Source: Sanford-Burnham Center for Chemical Genomics (SBCCG) Source Affiliation: Sanford-Burnham Medical Research Institute (SBMRI, San Diego, C...
PubChem Bioassay (2010)
BindingDB Entry DOI: 10.7270/Q2NS0SCW
Alkaline phosphatase, tissue-nonspecific isozyme
(Homo sapiens (Human))
BDBM39735
(MLS000566764 | N-(diphenylmethyl)-2-[methyl-[(4-ox...)
Show SMILES CN(CC(=O)NC(c1ccccc1)c1ccccc1)Cc1nc2ccccc2c(=O)[nH]1
Show InChI InChI=1S/C25H24N4O2/c1-29(16-22-26-21-15-9-8-14-20(21)25(31)27-22)17-23(30)28-24(18-10-4-2-5-11-18)19-12-6-3-7-13-19/h2-15,24H,16-17H2,1H3,(H,28,30)(H,26,27,31)
PCBioAssay
n/an/a 7.42E+4n/an/an/an/an/an/a
Burnham Center for Chemical Genomics
Curated by PubChem BioAssay
Assay Description
Data Source: Sanford-Burnham Center for Chemical Genomics (SBCCG) Source Affiliation: Sanford-Burnham Medical Research Institute (SBMRI, San Diego, C...
PubChem Bioassay (2010)
BindingDB Entry DOI: 10.7270/Q2H130G1
Intestinal alkaline phosphatase
(Homo sapiens (Human))
BDBM39735
(MLS000566764 | N-(diphenylmethyl)-2-[methyl-[(4-ox...)
Show SMILES CN(CC(=O)NC(c1ccccc1)c1ccccc1)Cc1nc2ccccc2c(=O)[nH]1
Show InChI InChI=1S/C25H24N4O2/c1-29(16-22-26-21-15-9-8-14-20(21)25(31)27-22)17-23(30)28-24(18-10-4-2-5-11-18)19-12-6-3-7-13-19/h2-15,24H,16-17H2,1H3,(H,28,30)(H,26,27,31)
PCBioAssay
n/an/a 2.66E+4n/an/an/an/an/an/a
Burnham Center for Chemical Genomics
Curated by PubChem BioAssay
Assay Description
Data Source: Sanford-Burnham Center for Chemical Genomics (SBCCG) Source Affiliation: Sanford-Burnham Medical Research Institute(SBMRI, San Diego, CA...
PubChem Bioassay (2010)
BindingDB Entry DOI: 10.7270/Q2X63KDM