BDBM39808 Acylglycineboronic acid, 3
SMILES: OB(O)CNC=O
InChI Key: InChIKey=UMNZDZYPRHOFGC-UHFFFAOYSA-N
Data: 2 KI
Activity Spreadsheet -- Enzyme Inhibition Constant Data from BindingDB
Found 2 hits for monomerid = 39808
Trg + Lig
Ki
nM
ΔG°
kcal/mole
IC50
nM
Kd
nM
EC50/IC50
nM
koff
s-1
kon
M-1s-1
pHTemp
°C
Beta-lactamase
(Escherichia coli)
BDBM39808
(Acylglycineboronic acid, 3)
Show SMILES OB(O)CNC=O
Show InChI InChI=1S/C2H6BNO3/c5-2-4-1-3(6)7/h2,6-7H,1H2,(H,4,5)
4.80E+3n/an/an/an/an/an/a7.0n/a
Northwestern University
Assay Description
Enzyme inhibition assay using AmpC or TEM-1 from escherichia coli.
Chem Biol 8: 17-31 (2001)
Article DOI: 10.1016/S1074-5521(00)00052-1
BindingDB Entry DOI: 10.7270/Q2CC0Z3R
Beta-lactamase
(Staphylococcus aureus)
BDBM39808
(Acylglycineboronic acid, 3)
Show SMILES OB(O)CNC=O
Show InChI InChI=1S/C2H6BNO3/c5-2-4-1-3(6)7/h2,6-7H,1H2,(H,4,5)
3.80E+4n/an/an/an/an/an/a7.0n/a
Northwestern University
Assay Description
Enzyme inhibition assay using AmpC or TEM-1 from escherichia coli.
Chem Biol 8: 17-31 (2001)
Article DOI: 10.1016/S1074-5521(00)00052-1
BindingDB Entry DOI: 10.7270/Q2CC0Z3R