BDBM39820 Amide and sulfonamide derivatives, 4
SMILES: OB(O)c1cccc(NS(=O)(=O)c2ccc(s2)S(=O)(=O)c2ccccc2)c1
InChI Key: InChIKey=QASOKUNWMKKJOJ-UHFFFAOYSA-N
Data: 1 KI
Activity Spreadsheet -- Enzyme Inhibition Constant Data from BindingDB
Found 1 hit for monomerid = 39820
Trg + Lig
Ki
nM
ΔG°
kcal/mole
IC50
nM
Kd
nM
EC50/IC50
nM
koff
s-1
kon
M-1s-1
pHTemp
°C
Beta-lactamase AmpC
(Escherichia coli)
BDBM39820
(Amide and sulfonamide derivatives, 4)
Show SMILES OB(O)c1cccc(NS(=O)(=O)c2ccc(s2)S(=O)(=O)c2ccccc2)c1
Show InChI InChI=1S/C16H14BNO6S3/c19-17(20)12-5-4-6-13(11-12)18-27(23,24)16-10-9-15(25-16)26(21,22)14-7-2-1-3-8-14/h1-11,18-20H
120n/an/an/an/an/an/a7.0n/a
Northwestern University
Assay Description
Inhibition assay against beta lactamase enzymes.
Chem Biol 8: 593-611 (2001)
Article DOI: 10.1016/S1074-5521(01)00034-5
BindingDB Entry DOI: 10.7270/Q27M06BZ