BDBM39851 Amide and sulfonamide derivatives, 35
SMILES: OB(O)c1cccc(NS(=O)(=O)c2cccc(NC(=O)c3ccc(cc3)C(O)=O)c2)c1
InChI Key: InChIKey=OWDIKGPDYLATDV-UHFFFAOYSA-N
Data: 1 KI
Activity Spreadsheet -- Enzyme Inhibition Constant Data from BindingDB
Found 1 hit for monomerid = 39851
Trg + Lig
Ki
nM
ΔG°
kcal/mole
IC50
nM
Kd
nM
EC50/IC50
nM
koff
s-1
kon
M-1s-1
pHTemp
°C
Beta-lactamase AmpC
(Escherichia coli)
BDBM39851
(Amide and sulfonamide derivatives, 35)
Show SMILES OB(O)c1cccc(NS(=O)(=O)c2cccc(NC(=O)c3ccc(cc3)C(O)=O)c2)c1
Show InChI InChI=1S/C20H17BN2O7S/c24-19(13-7-9-14(10-8-13)20(25)26)22-16-4-2-6-18(12-16)31(29,30)23-17-5-1-3-15(11-17)21(27)28/h1-12,23,27-28H,(H,22,24)(H,25,26)
450n/an/an/an/an/an/a7.0n/a
Northwestern University
Assay Description
Inhibition assay against beta lactamase enzymes.
Chem Biol 8: 593-611 (2001)
Article DOI: 10.1016/S1074-5521(01)00034-5
BindingDB Entry DOI: 10.7270/Q27M06BZ