BDBM39853 Amide and sulfonamide derivatives, 37
SMILES: OB(O)c1cccc(NS(=O)(=O)c2cccc(c2)N(=O)=O)c1
InChI Key: InChIKey=AQFNQEHXDLOIDW-UHFFFAOYSA-N
Data: 1 KI
Activity Spreadsheet -- Enzyme Inhibition Constant Data from BindingDB
Found 1 hit for monomerid = 39853
Trg + Lig
Ki
nM
ΔG°
kcal/mole
IC50
nM
Kd
nM
EC50/IC50
nM
koff
s-1
kon
M-1s-1
pHTemp
°C
Beta-lactamase AmpC
(Escherichia coli)
BDBM39853
(Amide and sulfonamide derivatives, 37)
Show SMILES OB(O)c1cccc(NS(=O)(=O)c2cccc(c2)N(=O)=O)c1
Show InChI InChI=1S/C12H11BN2O6S/c16-13(17)9-3-1-4-10(7-9)14-22(20,21)12-6-2-5-11(8-12)15(18)19/h1-8,14,16-17H
900n/an/an/an/an/an/a7.0n/a
Northwestern University
Assay Description
Inhibition assay against beta lactamase enzymes.
Chem Biol 8: 593-611 (2001)
Article DOI: 10.1016/S1074-5521(01)00034-5
BindingDB Entry DOI: 10.7270/Q27M06BZ