BDBM39855 Amide and sulfonamide derivatives, 39
SMILES: Nc1cccc(c1)S(=O)(=O)Nc1cccc(c1)B(O)O
InChI Key: InChIKey=KXGRDDXPOKTFPZ-UHFFFAOYSA-N
Data: 1 KI
Activity Spreadsheet -- Enzyme Inhibition Constant Data from BindingDB
Found 1 hit for monomerid = 39855
Trg + Lig
Ki
nM
ΔG°
kcal/mole
IC50
nM
Kd
nM
EC50/IC50
nM
koff
s-1
kon
M-1s-1
pHTemp
°C
Beta-lactamase AmpC
(Escherichia coli)
BDBM39855
(Amide and sulfonamide derivatives, 39)
Show SMILES Nc1cccc(c1)S(=O)(=O)Nc1cccc(c1)B(O)O
Show InChI InChI=1S/C12H13BN2O4S/c14-10-4-2-6-12(8-10)20(18,19)15-11-5-1-3-9(7-11)13(16)17/h1-8,15-17H,14H2
1.20E+3n/an/an/an/an/an/a7.0n/a
Northwestern University
Assay Description
Inhibition assay against beta lactamase enzymes.
Chem Biol 8: 593-611 (2001)
Article DOI: 10.1016/S1074-5521(01)00034-5
BindingDB Entry DOI: 10.7270/Q27M06BZ