BDBM4051 2-Amino-6-(2,6-dichlorophenyl)-8-propyl-8H-pyrido-[2,3-d]pyrimidin-7-one::2-amino-6-(2,6-dichlorophenyl)-8-propyl-7H,8H-pyrido[2,3-d]pyrimidin-7-one::pyrido[2,3-d]pyrimidin-7-one deriv. 6
SMILES: CCCn1c2nc(N)ncc2cc(-c2c(Cl)cccc2Cl)c1=O
InChI Key: InChIKey=URPMELUGCLZPCA-UHFFFAOYSA-N
Data: 3 IC50
Activity Spreadsheet -- Enzyme Inhibition Constant Data from BindingDB
Found 3 hits for monomerid = 4051
Trg + Lig
Ki
nM
ΔG°
kcal/mole
IC50
nM
Kd
nM
EC50/IC50
nM
koff
s-1
kon
M-1s-1
pHTemp
°C
Platelet-derived growth factor receptor beta
(Homo sapiens (Human))
BDBM4051
(2-Amino-6-(2,6-dichlorophenyl)-8-propyl-8H-pyrido-...)
Show SMILES CCCn1c2nc(N)ncc2cc(-c2c(Cl)cccc2Cl)c1=O |(-.32,-5.1,;-.32,-3.56,;-1.65,-2.79,;-1.65,-1.25,;-2.98,-.48,;-4.32,-1.25,;-5.65,-.48,;-6.98,-1.25,;-5.65,1.06,;-4.32,1.83,;-2.98,1.06,;-1.65,1.83,;-.32,1.06,;1.02,1.83,;1.02,3.37,;-.32,4.14,;2.35,4.14,;3.69,3.37,;3.69,1.83,;2.35,1.06,;2.35,-.48,;-.32,-.48,;1.02,-1.25,)|
Show InChI InChI=1S/C16H14Cl2N4O/c1-2-6-22-14-9(8-20-16(19)21-14)7-10(15(22)23)13-11(17)4-3-5-12(13)18/h3-5,7-8H,2,6H2,1H3,(H2,19,20,21)
NCI pathway
Reactome pathway
n/an/a 1.20E+3n/an/an/an/a7.425
Parke-Davis Pharmaceutical Research
Assay Description
IC50 is the inhibitor concentration which inhibits 50% of kinase activity that catalyzes the transfer of the terminal phosphate from [gamma-32P] labe...
J Med Chem 41: 4365-77 (1998)
Article DOI: 10.1021/jm980398y
BindingDB Entry DOI: 10.7270/Q2CC0XWN
Proto-oncogene tyrosine-protein kinase Src
(Homo sapiens (Human))
BDBM4051
(2-Amino-6-(2,6-dichlorophenyl)-8-propyl-8H-pyrido-...)
Show SMILES CCCn1c2nc(N)ncc2cc(-c2c(Cl)cccc2Cl)c1=O |(-.32,-5.1,;-.32,-3.56,;-1.65,-2.79,;-1.65,-1.25,;-2.98,-.48,;-4.32,-1.25,;-5.65,-.48,;-6.98,-1.25,;-5.65,1.06,;-4.32,1.83,;-2.98,1.06,;-1.65,1.83,;-.32,1.06,;1.02,1.83,;1.02,3.37,;-.32,4.14,;2.35,4.14,;3.69,3.37,;3.69,1.83,;2.35,1.06,;2.35,-.48,;-.32,-.48,;1.02,-1.25,)|
Show InChI InChI=1S/C16H14Cl2N4O/c1-2-6-22-14-9(8-20-16(19)21-14)7-10(15(22)23)13-11(17)4-3-5-12(13)18/h3-5,7-8H,2,6H2,1H3,(H2,19,20,21)
n/an/a 630n/an/an/an/a7.425
Parke-Davis Pharmaceutical Research
Assay Description
IC50 is the inhibitor concentration which inhibits 50% of kinase activity that catalyzes the transfer of the terminal phosphate from [gamma-32P] labe...
J Med Chem 41: 4365-77 (1998)
Article DOI: 10.1021/jm980398y
BindingDB Entry DOI: 10.7270/Q2CC0XWN
Fibroblast growth factor receptor 1
(Homo sapiens (Human))
BDBM4051
(2-Amino-6-(2,6-dichlorophenyl)-8-propyl-8H-pyrido-...)
Show SMILES CCCn1c2nc(N)ncc2cc(-c2c(Cl)cccc2Cl)c1=O |(-.32,-5.1,;-.32,-3.56,;-1.65,-2.79,;-1.65,-1.25,;-2.98,-.48,;-4.32,-1.25,;-5.65,-.48,;-6.98,-1.25,;-5.65,1.06,;-4.32,1.83,;-2.98,1.06,;-1.65,1.83,;-.32,1.06,;1.02,1.83,;1.02,3.37,;-.32,4.14,;2.35,4.14,;3.69,3.37,;3.69,1.83,;2.35,1.06,;2.35,-.48,;-.32,-.48,;1.02,-1.25,)|
Show InChI InChI=1S/C16H14Cl2N4O/c1-2-6-22-14-9(8-20-16(19)21-14)7-10(15(22)23)13-11(17)4-3-5-12(13)18/h3-5,7-8H,2,6H2,1H3,(H2,19,20,21)
NCI pathway
Reactome pathway
n/an/a 510n/an/an/an/a7.425
Parke-Davis Pharmaceutical Research
Assay Description
IC50 is the inhibitor concentration which inhibits 50% of kinase activity that catalyzes the transfer of the terminal phosphate from [gamma-32P] labe...
J Med Chem 41: 4365-77 (1998)
Article DOI: 10.1021/jm980398y
BindingDB Entry DOI: 10.7270/Q2CC0XWN