null
SMILES: CC(C)(C)OC(=O)Cn1c2nc(N)ncc2cc(-c2c(Cl)cccc2Cl)c1=O
InChI Key: InChIKey=FFTAUNHOICDGAW-UHFFFAOYSA-N
Activity Spreadsheet -- Enzyme Inhibition Constant Data from BindingDB
Found 3 hits for monomerid = 4055
Trg + Lig
Ki
nM
ΔG°
kcal/mole
IC50
nM
Kd
nM
EC50/IC50
nM
koff
s-1
kon
M-1s-1
pHTemp
°C
Platelet-derived growth factor receptor beta
(Homo sapiens (Human))
BDBM4055
([2-Amino-6-(2,6-dichlorophenyl)-7-oxo-7H-pyrido[2,...)
Show SMILES CC(C)(C)OC(=O)Cn1c2nc(N)ncc2cc(-c2c(Cl)cccc2Cl)c1=O |(3.69,-2.79,;2.35,-3.56,;2.35,-5.1,;3.69,-4.33,;1.02,-2.79,;-.32,-3.56,;-.32,-5.1,;-1.65,-2.79,;-1.65,-1.25,;-2.98,-.48,;-4.32,-1.25,;-5.65,-.48,;-6.98,-1.25,;-5.65,1.06,;-4.32,1.83,;-2.98,1.06,;-1.65,1.83,;-.32,1.06,;1.02,1.83,;1.02,3.37,;-.32,4.14,;2.35,4.14,;3.69,3.37,;3.69,1.83,;2.35,1.06,;2.35,-.48,;-.32,-.48,;1.02,-1.25,)|
Show InChI InChI=1S/C19H18Cl2N4O3/c1-19(2,3)28-14(26)9-25-16-10(8-23-18(22)24-16)7-11(17(25)27)15-12(20)5-4-6-13(15)21/h4-8H,9H2,1-3H3,(H2,22,23,24)
NCI pathway
Reactome pathway
n/an/a 7.20E+3n/an/an/an/a7.425
Parke-Davis Pharmaceutical Research
Assay Description
IC50 is the inhibitor concentration which inhibits 50% of kinase activity that catalyzes the transfer of the terminal phosphate from [gamma-32P] labe...
J Med Chem 41: 4365-77 (1998)
Article DOI: 10.1021/jm980398y
BindingDB Entry DOI: 10.7270/Q2CC0XWN
Proto-oncogene tyrosine-protein kinase Src
(Homo sapiens (Human))
BDBM4055
([2-Amino-6-(2,6-dichlorophenyl)-7-oxo-7H-pyrido[2,...)
Show SMILES CC(C)(C)OC(=O)Cn1c2nc(N)ncc2cc(-c2c(Cl)cccc2Cl)c1=O |(3.69,-2.79,;2.35,-3.56,;2.35,-5.1,;3.69,-4.33,;1.02,-2.79,;-.32,-3.56,;-.32,-5.1,;-1.65,-2.79,;-1.65,-1.25,;-2.98,-.48,;-4.32,-1.25,;-5.65,-.48,;-6.98,-1.25,;-5.65,1.06,;-4.32,1.83,;-2.98,1.06,;-1.65,1.83,;-.32,1.06,;1.02,1.83,;1.02,3.37,;-.32,4.14,;2.35,4.14,;3.69,3.37,;3.69,1.83,;2.35,1.06,;2.35,-.48,;-.32,-.48,;1.02,-1.25,)|
Show InChI InChI=1S/C19H18Cl2N4O3/c1-19(2,3)28-14(26)9-25-16-10(8-23-18(22)24-16)7-11(17(25)27)15-12(20)5-4-6-13(15)21/h4-8H,9H2,1-3H3,(H2,22,23,24)
n/an/a 560n/an/an/an/a7.425
Parke-Davis Pharmaceutical Research
Assay Description
IC50 is the inhibitor concentration which inhibits 50% of kinase activity that catalyzes the transfer of the terminal phosphate from [gamma-32P] labe...
J Med Chem 41: 4365-77 (1998)
Article DOI: 10.1021/jm980398y
BindingDB Entry DOI: 10.7270/Q2CC0XWN
Fibroblast growth factor receptor 1
(Homo sapiens (Human))
BDBM4055
([2-Amino-6-(2,6-dichlorophenyl)-7-oxo-7H-pyrido[2,...)
Show SMILES CC(C)(C)OC(=O)Cn1c2nc(N)ncc2cc(-c2c(Cl)cccc2Cl)c1=O |(3.69,-2.79,;2.35,-3.56,;2.35,-5.1,;3.69,-4.33,;1.02,-2.79,;-.32,-3.56,;-.32,-5.1,;-1.65,-2.79,;-1.65,-1.25,;-2.98,-.48,;-4.32,-1.25,;-5.65,-.48,;-6.98,-1.25,;-5.65,1.06,;-4.32,1.83,;-2.98,1.06,;-1.65,1.83,;-.32,1.06,;1.02,1.83,;1.02,3.37,;-.32,4.14,;2.35,4.14,;3.69,3.37,;3.69,1.83,;2.35,1.06,;2.35,-.48,;-.32,-.48,;1.02,-1.25,)|
Show InChI InChI=1S/C19H18Cl2N4O3/c1-19(2,3)28-14(26)9-25-16-10(8-23-18(22)24-16)7-11(17(25)27)15-12(20)5-4-6-13(15)21/h4-8H,9H2,1-3H3,(H2,22,23,24)
NCI pathway
Reactome pathway
n/an/a 1.70E+3n/an/an/an/a7.425
Parke-Davis Pharmaceutical Research
Assay Description
IC50 is the inhibitor concentration which inhibits 50% of kinase activity that catalyzes the transfer of the terminal phosphate from [gamma-32P] labe...
J Med Chem 41: 4365-77 (1998)
Article DOI: 10.1021/jm980398y
BindingDB Entry DOI: 10.7270/Q2CC0XWN