BDBM4075 8-Ethyl-2-phenylamino-6-thiophene-3-yl-8H-pyrido-[2,3-d]pyrimidin-7-one::8-ethyl-2-(phenylamino)-6-(thiophen-3-yl)-7H,8H-pyrido[2,3-d]pyrimidin-7-one::pyrido[2,3-d]pyrimidin-7-one deriv. 48
SMILES: CCn1c2nc(Nc3ccccc3)ncc2cc(-c2ccsc2)c1=O
InChI Key: InChIKey=WPUHUROYCYWEDW-UHFFFAOYSA-N
Data: 3 IC50
Activity Spreadsheet -- Enzyme Inhibition Constant Data from BindingDB
Found 3 hits for monomerid = 4075
Trg + Lig
Ki
nM
ΔG°
kcal/mole
IC50
nM
Kd
nM
EC50/IC50
nM
koff
s-1
kon
M-1s-1
pHTemp
°C
Platelet-derived growth factor receptor beta
(Homo sapiens (Human))
BDBM4075
(8-Ethyl-2-phenylamino-6-thiophene-3-yl-8H-pyrido-[...)
Show SMILES CCn1c2nc(Nc3ccccc3)ncc2cc(-c2ccsc2)c1=O
Show InChI InChI=1S/C19H16N4OS/c1-2-23-17-14(10-16(18(23)24)13-8-9-25-12-13)11-20-19(22-17)21-15-6-4-3-5-7-15/h3-12H,2H2,1H3,(H,20,21,22)
NCI pathway
Reactome pathway
n/an/a 410n/an/an/an/an/an/a
Parke-Davis Pharmaceutical Research
Assay Description
IC50 is the inhibitor concentration which inhibits 50% of kinase activity that catalyzes the transfer of the terminal phosphate from [gamma-32P] labe...
J Med Chem 41: 4365-77 (1998)
Article DOI: 10.1021/jm980398y
BindingDB Entry DOI: 10.7270/Q2CC0XWN
Proto-oncogene tyrosine-protein kinase Src
(Homo sapiens (Human))
BDBM4075
(8-Ethyl-2-phenylamino-6-thiophene-3-yl-8H-pyrido-[...)
Show SMILES CCn1c2nc(Nc3ccccc3)ncc2cc(-c2ccsc2)c1=O
Show InChI InChI=1S/C19H16N4OS/c1-2-23-17-14(10-16(18(23)24)13-8-9-25-12-13)11-20-19(22-17)21-15-6-4-3-5-7-15/h3-12H,2H2,1H3,(H,20,21,22)
n/an/a 4.10E+4n/an/an/an/an/an/a
Parke-Davis Pharmaceutical Research
Assay Description
IC50 is the inhibitor concentration which inhibits 50% of kinase activity that catalyzes the transfer of the terminal phosphate from [gamma-32P] labe...
J Med Chem 41: 4365-77 (1998)
Article DOI: 10.1021/jm980398y
BindingDB Entry DOI: 10.7270/Q2CC0XWN
Fibroblast growth factor receptor 1
(Homo sapiens (Human))
BDBM4075
(8-Ethyl-2-phenylamino-6-thiophene-3-yl-8H-pyrido-[...)
Show SMILES CCn1c2nc(Nc3ccccc3)ncc2cc(-c2ccsc2)c1=O
Show InChI InChI=1S/C19H16N4OS/c1-2-23-17-14(10-16(18(23)24)13-8-9-25-12-13)11-20-19(22-17)21-15-6-4-3-5-7-15/h3-12H,2H2,1H3,(H,20,21,22)
NCI pathway
Reactome pathway
n/an/a>5.00E+4n/an/an/an/an/an/a
Parke-Davis Pharmaceutical Research
Assay Description
IC50 is the inhibitor concentration which inhibits 50% of kinase activity that catalyzes the transfer of the terminal phosphate from [gamma-32P] labe...
J Med Chem 41: 4365-77 (1998)
Article DOI: 10.1021/jm980398y
BindingDB Entry DOI: 10.7270/Q2CC0XWN