BDBM40752 2,6-bis(fluoranyl)-N-(5-imidazo[1,2-a]pyrimidin-2-yl-2-methoxy-phenyl)benzamide::2,6-difluoro-N-(5-imidazo[1,2-a]pyrimidin-2-yl-2-methoxy-phenyl)benzamide::2,6-difluoro-N-(5-imidazo[1,2-a]pyrimidin-2-yl-2-methoxyphenyl)benzamide::2,6-difluoro-N-[5-(2-imidazo[1,2-a]pyrimidinyl)-2-methoxyphenyl]benzamide::UNM000003660701::cid_7080277
SMILES: COc1ccc(cc1NC(=O)c1c(F)cccc1F)-c1cn2cccnc2n1
InChI Key: InChIKey=AYRXIDNIFRECGJ-UHFFFAOYSA-N
Data: 2 KI  2 IC50
Activity Spreadsheet -- Enzyme Inhibition Constant Data from BindingDB
Found 4 hits for monomerid = 40752
Trg + Lig
Ki
nM
ΔG°
kcal/mole
IC50
nM
Kd
nM
EC50/IC50
nM
koff
s-1
kon
M-1s-1
pHTemp
°C
N-formyl peptide receptor 2
(Homo sapiens (Human))
BDBM40752
(2,6-bis(fluoranyl)-N-(5-imidazo[1,2-a]pyrimidin-2-...)
Show SMILES COc1ccc(cc1NC(=O)c1c(F)cccc1F)-c1cn2cccnc2n1
Show InChI InChI=1S/C20H14F2N4O2/c1-28-17-7-6-12(16-11-26-9-3-8-23-20(26)25-16)10-15(17)24-19(27)18-13(21)4-2-5-14(18)22/h2-11H,1H3,(H,24,27)
NCI pathway
Reactome pathway
PCBioAssay
>3.53E+4n/an/an/an/an/an/an/an/a
NMMLSC
Curated by PubChem BioAssay
Assay Description
University of New Mexico Assay Overview: Assay Support: NIH 1R03MH076381-01 Assay for Formylpeptide Receptor Family Ligands PI: Bruce S. Edwards, Ph...
PubChem Bioassay (2007)
BindingDB Entry DOI: 10.7270/Q2SF2TKJ
fMet-Leu-Phe receptor
(Homo sapiens (Human))
BDBM40752
(2,6-bis(fluoranyl)-N-(5-imidazo[1,2-a]pyrimidin-2-...)
Show SMILES COc1ccc(cc1NC(=O)c1c(F)cccc1F)-c1cn2cccnc2n1
Show InChI InChI=1S/C20H14F2N4O2/c1-28-17-7-6-12(16-11-26-9-3-8-23-20(26)25-16)10-15(17)24-19(27)18-13(21)4-2-5-14(18)22/h2-11H,1H3,(H,24,27)
Reactome pathway
PCBioAssay
>3.82E+4n/an/an/an/an/an/an/an/a
NMMLSC
Curated by PubChem BioAssay
Assay Description
University of New Mexico Assay Overview: Assay Support: NIH 1R03MH076381-01 Assay for Formylpeptide Receptor Family Ligands PI: Bruce S. Edwards, Ph...
PubChem Bioassay (2007)
BindingDB Entry DOI: 10.7270/Q21V5CBG
fMet-Leu-Phe receptor
(Homo sapiens (Human))
BDBM40752
(2,6-bis(fluoranyl)-N-(5-imidazo[1,2-a]pyrimidin-2-...)
Show SMILES COc1ccc(cc1NC(=O)c1c(F)cccc1F)-c1cn2cccnc2n1
Show InChI InChI=1S/C20H14F2N4O2/c1-28-17-7-6-12(16-11-26-9-3-8-23-20(26)25-16)10-15(17)24-19(27)18-13(21)4-2-5-14(18)22/h2-11H,1H3,(H,24,27)
Reactome pathway
PCBioAssay
n/an/a>5.84E+4n/an/an/an/an/an/a
NMMLSC
Curated by PubChem BioAssay
Assay Description
University of New Mexico Assay Overview: Assay Support: NIH 1R03MH076381-01 Assay for Formylpeptide Receptor Family Ligands PI: Bruce S. Edwards, Ph...
PubChem Bioassay (2007)
BindingDB Entry DOI: 10.7270/Q2X34VV3
N-formyl peptide receptor 2
(Homo sapiens (Human))
BDBM40752
(2,6-bis(fluoranyl)-N-(5-imidazo[1,2-a]pyrimidin-2-...)
Show SMILES COc1ccc(cc1NC(=O)c1c(F)cccc1F)-c1cn2cccnc2n1
Show InChI InChI=1S/C20H14F2N4O2/c1-28-17-7-6-12(16-11-26-9-3-8-23-20(26)25-16)10-15(17)24-19(27)18-13(21)4-2-5-14(18)22/h2-11H,1H3,(H,24,27)
NCI pathway
Reactome pathway
PCBioAssay
n/an/a>5.84E+4n/an/an/an/an/an/a
NMMLSC
Curated by PubChem BioAssay
Assay Description
University of New Mexico Assay Overview: Assay Support: NIH 1R03MH076381-01 Assay for Formylpeptide Receptor Family Ligands PI: Bruce S. Edwards, Ph...
PubChem Bioassay (2007)
BindingDB Entry DOI: 10.7270/Q2NP22V6