BDBM40795 2-Biphenyl-4-yl-N-(2-morpholin-4-yl-ethyl)-acetamide::MLS000031311::N-(2-morpholin-4-ylethyl)-2-(4-phenylphenyl)acetamide::N-(2-morpholin-4-ylethyl)-2-(4-phenylphenyl)ethanamide::N-(2-morpholinoethyl)-2-(4-phenylphenyl)acetamide::N-[2-(4-morpholinyl)ethyl]-2-(4-phenylphenyl)acetamide::SMR000013269::cid_649839
SMILES: O=C(Cc1ccc(cc1)-c1ccccc1)NCCN1CCOCC1
InChI Key: InChIKey=YVNNWBDUJDYFQM-UHFFFAOYSA-N
Data: 1 IC50
Activity Spreadsheet -- Enzyme Inhibition Constant Data from BindingDB
Found 1 hit for monomerid = 40795
Trg + Lig
Ki
nM
ΔG°
kcal/mole
IC50
nM
Kd
nM
EC50/IC50
nM
koff
s-1
kon
M-1s-1
pHTemp
°C
Complement C1s
(Homo sapiens (Human))
BDBM40795
(2-Biphenyl-4-yl-N-(2-morpholin-4-yl-ethyl)-acetami...)
Show SMILES O=C(Cc1ccc(cc1)-c1ccccc1)NCCN1CCOCC1
Show InChI InChI=1S/C20H24N2O2/c23-20(21-10-11-22-12-14-24-15-13-22)16-17-6-8-19(9-7-17)18-4-2-1-3-5-18/h1-9H,10-16H2,(H,21,23)
Reactome pathway
PCBioAssay
n/an/a>5.00E+4n/an/an/an/an/an/a
PCMD
Curated by PubChem BioAssay
Assay Description
Molecular Library Screening Center Network (MLSCN) Penn Center for Molecular Discovery (PCMD) Assay Provider: Dr. Scott L. Diamond, University of Pen...
PubChem Bioassay (2008)
BindingDB Entry DOI: 10.7270/Q2MP51PC