BDBM4123 (2S,4S)-N-tert-butyl-4-chloro-1-[(2S,3S)-2-hydroxy-3-[(3-hydroxy-2-methylphenyl)formamido]-5-phenylpentanoyl]pyrrolidine-2-carboxamide::(3-Hydroxy-2-methylbenzoyl)-(2(S)-hydroxy-3(S)-amino-5-phenylpentanoyl)-4(S)-Cl-Pro-NH-t-Bu::AHPPA deriv. 8
SMILES: Cc1c(O)cccc1C(=O)N[C@@H](CCc1ccccc1)[C@H](O)C(=O)N1C[C@@H](Cl)C[C@H]1C(=O)NC(C)(C)C
InChI Key: InChIKey=ZDOFSOVSNDBLFC-CHLMOITFSA-N
Data: 1 IC50
Activity Spreadsheet -- Enzyme Inhibition Constant Data from BindingDB
Found 1 hit for monomerid = 4123
Trg + Lig
Ki
nM
ΔG°
kcal/mole
IC50
nM
Kd
nM
EC50/IC50
nM
koff
s-1
kon
M-1s-1
pHTemp
°C
HIV-1 Protease
(Human immunodeficiency virus type 1)
BDBM4123
((2S,4S)-N-tert-butyl-4-chloro-1-[(2S,3S)-2-hydroxy...)
Show SMILES Cc1c(O)cccc1C(=O)N[C@@H](CCc1ccccc1)[C@H](O)C(=O)N1C[C@@H](Cl)C[C@H]1C(=O)NC(C)(C)C |r|
Show InChI InChI=1S/C28H36ClN3O5/c1-17-20(11-8-12-23(17)33)25(35)30-21(14-13-18-9-6-5-7-10-18)24(34)27(37)32-16-19(29)15-22(32)26(36)31-28(2,3)4/h5-12,19,21-22,24,33-34H,13-16H2,1-4H3,(H,30,35)(H,31,36)/t19-,21-,22-,24-/m0/s1
n/an/a 1.40n/an/an/an/an/an/a
Sankyo Co. Ltd.
Assay Description
The inhibitory activities of the compounds toward HIV-1 PR were determined by sodium dodecyl sulfate-polyacrylamide gel electrophoresis (SDS-PAGE) as...
Bioorg Med Chem 7: 2063-72 (1999)
Article DOI: 10.1016/s0968-0896(99)00127-3
BindingDB Entry DOI: 10.7270/Q23T9FD0