BDBM4138 (2S,4S)-N-tert-butyl-4-chloro-1-[(2S,3S)-2-hydroxy-3-[(3-hydroxy-2-methylphenyl)formamido]-4-(4-phenylphenyl)butanoyl]pyrrolidine-2-carboxamide::(3-Hydroxy-2-methylbenzoyl)-{2(S)-hydroxy-3(S)-amino-4-(4-phenyl)-phenylbutanoyl}-4(S)-Cl-Pro-NH-t-Bu::AHPBA deriv. 23
SMILES: Cc1c(O)cccc1C(=O)N[C@@H](Cc1ccc(cc1)-c1ccccc1)[C@H](O)C(=O)N1C[C@@H](Cl)C[C@H]1C(=O)NC(C)(C)C
InChI Key: InChIKey=XGBWMQFBISAPFD-CXXWFMJBSA-N
Data: 1 IC50
Activity Spreadsheet -- Enzyme Inhibition Constant Data from BindingDB
Found 1 hit for monomerid = 4138
Trg + Lig
Ki
nM
ΔG°
kcal/mole
IC50
nM
Kd
nM
EC50/IC50
nM
koff
s-1
kon
M-1s-1
pHTemp
°C
HIV-1 Protease
(Human immunodeficiency virus type 1)
BDBM4138
((2S,4S)-N-tert-butyl-4-chloro-1-[(2S,3S)-2-hydroxy...)
Show SMILES Cc1c(O)cccc1C(=O)N[C@@H](Cc1ccc(cc1)-c1ccccc1)[C@H](O)C(=O)N1C[C@@H](Cl)C[C@H]1C(=O)NC(C)(C)C |r|
Show InChI InChI=1S/C33H38ClN3O5/c1-20-25(11-8-12-28(20)38)30(40)35-26(17-21-13-15-23(16-14-21)22-9-6-5-7-10-22)29(39)32(42)37-19-24(34)18-27(37)31(41)36-33(2,3)4/h5-16,24,26-27,29,38-39H,17-19H2,1-4H3,(H,35,40)(H,36,41)/t24-,26-,27-,29-/m0/s1
n/an/a 0.900n/an/an/an/an/an/a
Sankyo Co. Ltd.
Assay Description
The inhibitory activities of the compounds toward HIV-1 PR were determined by sodium dodecyl sulfate-polyacrylamide gel electrophoresis (SDS-PAGE) as...
Bioorg Med Chem 7: 2063-72 (1999)
Article DOI: 10.1016/s0968-0896(99)00127-3
BindingDB Entry DOI: 10.7270/Q23T9FD0