BDBM4142 (2S,4S)-N-tert-butyl-4-chloro-1-[(2S,3S)-2-hydroxy-3-[(3-hydroxy-2-methylphenyl)formamido]-4-(naphthalen-2-yl)butanoyl]pyrrolidine-2-carboxamide::(3-Hydroxy-2-methylbenzoyl)-{2(S)-hydroxy-3(S)-amino-4-(beta-naphtyl)-butanoyl}-4(S)-Cl-Pro-NH-t-Bu::AHPBA deriv. 27
SMILES: Cc1c(O)cccc1C(=O)N[C@@H](Cc1ccc2ccccc2c1)[C@H](O)C(=O)N1C[C@@H](Cl)C[C@H]1C(=O)NC(C)(C)C
InChI Key: InChIKey=IFFAERFMTGDNBM-IXPOFIJOSA-N
Data: 1 IC50
Activity Spreadsheet -- Enzyme Inhibition Constant Data from BindingDB
Found 1 hit for monomerid = 4142
Trg + Lig
Ki
nM
ΔG°
kcal/mole
IC50
nM
Kd
nM
EC50/IC50
nM
koff
s-1
kon
M-1s-1
pHTemp
°C
HIV-1 Protease
(Human immunodeficiency virus type 1)
BDBM4142
((2S,4S)-N-tert-butyl-4-chloro-1-[(2S,3S)-2-hydroxy...)
Show SMILES Cc1c(O)cccc1C(=O)N[C@@H](Cc1ccc2ccccc2c1)[C@H](O)C(=O)N1C[C@@H](Cl)C[C@H]1C(=O)NC(C)(C)C |r|
Show InChI InChI=1S/C31H36ClN3O5/c1-18-23(10-7-11-26(18)36)28(38)33-24(15-19-12-13-20-8-5-6-9-21(20)14-19)27(37)30(40)35-17-22(32)16-25(35)29(39)34-31(2,3)4/h5-14,22,24-25,27,36-37H,15-17H2,1-4H3,(H,33,38)(H,34,39)/t22-,24-,25-,27-/m0/s1
n/an/a 1n/an/an/an/an/an/a
Sankyo Co. Ltd.
Assay Description
The inhibitory activities of the compounds toward HIV-1 PR were determined by sodium dodecyl sulfate-polyacrylamide gel electrophoresis (SDS-PAGE) as...
Bioorg Med Chem 7: 2063-72 (1999)
Article DOI: 10.1016/s0968-0896(99)00127-3
BindingDB Entry DOI: 10.7270/Q23T9FD0