BDBM4147 (2S,4S)-N-tert-butyl-4-chloro-1-[(2S,3S)-2-hydroxy-3-[(3-hydroxy-2,4-dimethylphenyl)formamido]-4-[3-(trifluoromethyl)phenyl]butanoyl]pyrrolidine-2-carboxamide::(3-Hydroxy-2,4-dimethylbenzoyl)-{2(S)-hydroxy-3(S)-amino-4-(3-trifluoromethyl)-phenylbutanoyl}-4(S)-Cl-Pro-NH-t-Bu::AHPBA deriv. 32::CHEMBL116439
SMILES: Cc1ccc(C(=O)N[C@@H](Cc2cccc(c2)C(F)(F)F)[C@H](O)C(=O)N2C[C@@H](Cl)C[C@H]2C(=O)NC(C)(C)C)c(C)c1O
InChI Key: InChIKey=RVCBVTQTCONCKN-CHLMOITFSA-N
Data: 2 IC50
Activity Spreadsheet -- Enzyme Inhibition Constant Data from BindingDB
Found 2 hits for monomerid = 4147
Trg + Lig
Ki
nM
ΔG°
kcal/mole
IC50
nM
Kd
nM
EC50/IC50
nM
koff
s-1
kon
M-1s-1
pHTemp
°C
Human immunodeficiency virus type 1 protease
(Human immunodeficiency virus type 1)
BDBM4147
((2S,4S)-N-tert-butyl-4-chloro-1-[(2S,3S)-2-hydroxy...)
Show SMILES Cc1ccc(C(=O)N[C@@H](Cc2cccc(c2)C(F)(F)F)[C@H](O)C(=O)N2C[C@@H](Cl)C[C@H]2C(=O)NC(C)(C)C)c(C)c1O |r|
Show InChI InChI=1S/C29H35ClF3N3O5/c1-15-9-10-20(16(2)23(15)37)25(39)34-21(12-17-7-6-8-18(11-17)29(31,32)33)24(38)27(41)36-14-19(30)13-22(36)26(40)35-28(3,4)5/h6-11,19,21-22,24,37-38H,12-14H2,1-5H3,(H,34,39)(H,35,40)/t19-,21-,22-,24-/m0/s1
n/an/a 3.5n/an/an/an/an/an/a
Chinese Academy of Sciences
Curated by ChEMBL
Assay Description
Inhibitory activity against HIV-1 protease
J Med Chem 45: 333-43 (2002)
BindingDB Entry DOI: 10.7270/Q20K27VB
HIV-1 Protease
(Human immunodeficiency virus type 1)
BDBM4147
((2S,4S)-N-tert-butyl-4-chloro-1-[(2S,3S)-2-hydroxy...)
Show SMILES Cc1ccc(C(=O)N[C@@H](Cc2cccc(c2)C(F)(F)F)[C@H](O)C(=O)N2C[C@@H](Cl)C[C@H]2C(=O)NC(C)(C)C)c(C)c1O |r|
Show InChI InChI=1S/C29H35ClF3N3O5/c1-15-9-10-20(16(2)23(15)37)25(39)34-21(12-17-7-6-8-18(11-17)29(31,32)33)24(38)27(41)36-14-19(30)13-22(36)26(40)35-28(3,4)5/h6-11,19,21-22,24,37-38H,12-14H2,1-5H3,(H,34,39)(H,35,40)/t19-,21-,22-,24-/m0/s1
n/an/a 3.5n/an/an/an/an/an/a
Sankyo Co. Ltd.
Assay Description
The inhibitory activities of the compounds toward HIV-1 PR were determined by sodium dodecyl sulfate-polyacrylamide gel electrophoresis (SDS-PAGE) as...
Bioorg Med Chem 7: 2063-72 (1999)
Article DOI: 10.1016/s0968-0896(99)00127-3
BindingDB Entry DOI: 10.7270/Q23T9FD0