BDBM4155 (2S,4S)-N-tert-butyl-4-chloro-1-[(2S,3S)-2-hydroxy-3-[(3-hydroxy-2,6-dimethylphenyl)formamido]-4-(3-methylphenyl)butanoyl]pyrrolidine-2-carboxamide::(3-Hydroxy-2,6-dimethylbenzoyl)-(2(S)-hydroxy-3(S)-amino-4-m-tolylbutanoyl)-4(S)-Cl-Pro-NH-t-Bu::AHPBA deriv. 40::CHEMBL327147
SMILES: Cc1cccc(C[C@H](NC(=O)c2c(C)ccc(O)c2C)[C@H](O)C(=O)N2C[C@@H](Cl)C[C@H]2C(=O)NC(C)(C)C)c1
InChI Key: InChIKey=YOBNADNOMIABOE-UEOMBKFZSA-N
Data: 2 IC50
Activity Spreadsheet -- Enzyme Inhibition Constant Data from BindingDB
Found 2 hits for monomerid = 4155
Trg + Lig
Ki
nM
ΔG°
kcal/mole
IC50
nM
Kd
nM
EC50/IC50
nM
koff
s-1
kon
M-1s-1
pHTemp
°C
Human immunodeficiency virus type 1 protease
(Human immunodeficiency virus type 1)
BDBM4155
((2S,4S)-N-tert-butyl-4-chloro-1-[(2S,3S)-2-hydroxy...)
Show SMILES Cc1cccc(C[C@H](NC(=O)c2c(C)ccc(O)c2C)[C@H](O)C(=O)N2C[C@@H](Cl)C[C@H]2C(=O)NC(C)(C)C)c1 |r|
Show InChI InChI=1S/C29H38ClN3O5/c1-16-8-7-9-19(12-16)13-21(31-27(37)24-17(2)10-11-23(34)18(24)3)25(35)28(38)33-15-20(30)14-22(33)26(36)32-29(4,5)6/h7-12,20-22,25,34-35H,13-15H2,1-6H3,(H,31,37)(H,32,36)/t20-,21-,22-,25-/m0/s1
n/an/a 3.40n/an/an/an/an/an/a
Chinese Academy of Sciences
Curated by ChEMBL
Assay Description
Inhibitory activity against HIV-1 protease
J Med Chem 45: 333-43 (2002)
BindingDB Entry DOI: 10.7270/Q20K27VB
HIV-1 Protease
(Human immunodeficiency virus type 1)
BDBM4155
((2S,4S)-N-tert-butyl-4-chloro-1-[(2S,3S)-2-hydroxy...)
Show SMILES Cc1cccc(C[C@H](NC(=O)c2c(C)ccc(O)c2C)[C@H](O)C(=O)N2C[C@@H](Cl)C[C@H]2C(=O)NC(C)(C)C)c1 |r|
Show InChI InChI=1S/C29H38ClN3O5/c1-16-8-7-9-19(12-16)13-21(31-27(37)24-17(2)10-11-23(34)18(24)3)25(35)28(38)33-15-20(30)14-22(33)26(36)32-29(4,5)6/h7-12,20-22,25,34-35H,13-15H2,1-6H3,(H,31,37)(H,32,36)/t20-,21-,22-,25-/m0/s1
n/an/a 3.40n/an/an/an/an/an/a
Sankyo Co. Ltd.
Assay Description
The inhibitory activities of the compounds toward HIV-1 PR were determined by sodium dodecyl sulfate-polyacrylamide gel electrophoresis (SDS-PAGE) as...
Bioorg Med Chem 7: 2063-72 (1999)
Article DOI: 10.1016/s0968-0896(99)00127-3
BindingDB Entry DOI: 10.7270/Q23T9FD0