BDBM4178 1,6-naphthyridin-2(1H)-one deriv. 7k::3-(2,6-Dichlorophenyl)-1-methyl-7-[[3-(4-morpholino)-propyl]amino]-1,6-naphthyridin-2(1H)-one::3-(2,6-dichlorophenyl)-1-methyl-7-{[3-(morpholin-4-yl)propyl]amino}-1,2-dihydro-1,6-naphthyridin-2-one
SMILES: Cn1c2cc(NCCCN3CCOCC3)ncc2cc(-c2c(Cl)cccc2Cl)c1=O
InChI Key: InChIKey=CYFCBAYGOYPBEA-UHFFFAOYSA-N
Data: 3 IC50
Activity Spreadsheet -- Enzyme Inhibition Constant Data from BindingDB
Found 3 hits for monomerid = 4178
Trg + Lig
Ki
nM
ΔG°
kcal/mole
IC50
nM
Kd
nM
EC50/IC50
nM
koff
s-1
kon
M-1s-1
pHTemp
°C
Platelet-derived growth factor receptor beta
(Homo sapiens (Human))
BDBM4178
(1,6-naphthyridin-2(1H)-one deriv. 7k | 3-(2,6-Dich...)
Show SMILES Cn1c2cc(NCCCN3CCOCC3)ncc2cc(-c2c(Cl)cccc2Cl)c1=O |(-1.18,-3.43,;-1.18,-1.89,;-2.52,-1.12,;-3.85,-1.95,;-5.18,-1.18,;-6.52,-1.95,;-7.85,-1.18,;-9.18,-1.95,;-10.52,-1.18,;-11.85,-1.95,;-13.19,-1.18,;-14.52,-1.95,;-14.52,-3.49,;-13.19,-4.26,;-11.85,-3.49,;-5.18,.36,;-3.85,1.13,;-2.52,.42,;-1.18,1.19,;.15,.42,;1.48,1.19,;1.48,2.73,;.15,3.5,;2.82,3.5,;4.15,2.73,;4.15,1.19,;2.82,.42,;2.82,-1.12,;.15,-1.12,;1.48,-1.89,)|
Show InChI InChI=1S/C22H24Cl2N4O2/c1-27-19-13-20(25-6-3-7-28-8-10-30-11-9-28)26-14-15(19)12-16(22(27)29)21-17(23)4-2-5-18(21)24/h2,4-5,12-14H,3,6-11H2,1H3,(H,25,26)
NCI pathway
Reactome pathway
n/an/a 5.80E+3n/an/an/an/an/an/a
University of Auckland
Assay Description
IC50 is the inhibitor concentration which inhibits 50% of kinase activity that catalyzes the transfer of the terminal phosphate from [gamma-32P] labe...
J Med Chem 43: 3134-47 (2000)
Article DOI: 10.1021/jm000148t
BindingDB Entry DOI: 10.7270/Q2028PQ1
Proto-oncogene tyrosine-protein kinase Src
(Homo sapiens (Human))
BDBM4178
(1,6-naphthyridin-2(1H)-one deriv. 7k | 3-(2,6-Dich...)
Show SMILES Cn1c2cc(NCCCN3CCOCC3)ncc2cc(-c2c(Cl)cccc2Cl)c1=O |(-1.18,-3.43,;-1.18,-1.89,;-2.52,-1.12,;-3.85,-1.95,;-5.18,-1.18,;-6.52,-1.95,;-7.85,-1.18,;-9.18,-1.95,;-10.52,-1.18,;-11.85,-1.95,;-13.19,-1.18,;-14.52,-1.95,;-14.52,-3.49,;-13.19,-4.26,;-11.85,-3.49,;-5.18,.36,;-3.85,1.13,;-2.52,.42,;-1.18,1.19,;.15,.42,;1.48,1.19,;1.48,2.73,;.15,3.5,;2.82,3.5,;4.15,2.73,;4.15,1.19,;2.82,.42,;2.82,-1.12,;.15,-1.12,;1.48,-1.89,)|
Show InChI InChI=1S/C22H24Cl2N4O2/c1-27-19-13-20(25-6-3-7-28-8-10-30-11-9-28)26-14-15(19)12-16(22(27)29)21-17(23)4-2-5-18(21)24/h2,4-5,12-14H,3,6-11H2,1H3,(H,25,26)
n/an/a 200n/an/an/an/an/an/a
University of Auckland
Assay Description
IC50 is the inhibitor concentration which inhibits 50% of kinase activity that catalyzes the transfer of the terminal phosphate from [gamma-32P] labe...
J Med Chem 43: 3134-47 (2000)
Article DOI: 10.1021/jm000148t
BindingDB Entry DOI: 10.7270/Q2028PQ1
Fibroblast growth factor receptor 1
(Homo sapiens (Human))
BDBM4178
(1,6-naphthyridin-2(1H)-one deriv. 7k | 3-(2,6-Dich...)
Show SMILES Cn1c2cc(NCCCN3CCOCC3)ncc2cc(-c2c(Cl)cccc2Cl)c1=O |(-1.18,-3.43,;-1.18,-1.89,;-2.52,-1.12,;-3.85,-1.95,;-5.18,-1.18,;-6.52,-1.95,;-7.85,-1.18,;-9.18,-1.95,;-10.52,-1.18,;-11.85,-1.95,;-13.19,-1.18,;-14.52,-1.95,;-14.52,-3.49,;-13.19,-4.26,;-11.85,-3.49,;-5.18,.36,;-3.85,1.13,;-2.52,.42,;-1.18,1.19,;.15,.42,;1.48,1.19,;1.48,2.73,;.15,3.5,;2.82,3.5,;4.15,2.73,;4.15,1.19,;2.82,.42,;2.82,-1.12,;.15,-1.12,;1.48,-1.89,)|
Show InChI InChI=1S/C22H24Cl2N4O2/c1-27-19-13-20(25-6-3-7-28-8-10-30-11-9-28)26-14-15(19)12-16(22(27)29)21-17(23)4-2-5-18(21)24/h2,4-5,12-14H,3,6-11H2,1H3,(H,25,26)
NCI pathway
Reactome pathway
n/an/a 570n/an/an/an/an/an/a
University of Auckland
Assay Description
IC50 is the inhibitor concentration which inhibits 50% of kinase activity that catalyzes the transfer of the terminal phosphate from [gamma-32P] labe...
J Med Chem 43: 3134-47 (2000)
Article DOI: 10.1021/jm000148t
BindingDB Entry DOI: 10.7270/Q2028PQ1