BDBM4182 1,6-naphthyridin-2(1H)-one deriv. 7o::3-(2,6-Dichlorophenyl)-1-methyl-7-(4-pyridinylamino)-1,6-naphthyridin-2(1H)-one::3-(2,6-dichlorophenyl)-1-methyl-7-(pyridin-4-ylamino)-1,2-dihydro-1,6-naphthyridin-2-one
SMILES: Cn1c2cc(Nc3ccncc3)ncc2cc(-c2c(Cl)cccc2Cl)c1=O
InChI Key: InChIKey=IYUMDJZHUWJJBD-UHFFFAOYSA-N
Data: 3 IC50
Activity Spreadsheet -- Enzyme Inhibition Constant Data from BindingDB
Found 3 hits for monomerid = 4182
Trg + Lig
Ki
nM
ΔG°
kcal/mole
IC50
nM
Kd
nM
EC50/IC50
nM
koff
s-1
kon
M-1s-1
pHTemp
°C
Platelet-derived growth factor receptor beta
(Homo sapiens (Human))
BDBM4182
(1,6-naphthyridin-2(1H)-one deriv. 7o | 3-(2,6-Dich...)
Show SMILES Cn1c2cc(Nc3ccncc3)ncc2cc(-c2c(Cl)cccc2Cl)c1=O |(-1.18,-3.43,;-1.18,-1.89,;-2.52,-1.12,;-3.85,-1.95,;-5.18,-1.18,;-6.52,-1.95,;-7.85,-1.18,;-7.85,.36,;-9.18,1.13,;-10.52,.36,;-10.52,-1.18,;-9.18,-1.95,;-5.18,.36,;-3.85,1.13,;-2.52,.42,;-1.18,1.19,;.15,.42,;1.48,1.19,;1.48,2.73,;.15,3.5,;2.82,3.5,;4.15,2.73,;4.15,1.19,;2.82,.42,;2.82,-1.12,;.15,-1.12,;1.48,-1.89,)|
Show InChI InChI=1S/C20H14Cl2N4O/c1-26-17-10-18(25-13-5-7-23-8-6-13)24-11-12(17)9-14(20(26)27)19-15(21)3-2-4-16(19)22/h2-11H,1H3,(H,23,24,25)
NCI pathway
Reactome pathway
n/an/a 6.90E+3n/an/an/an/an/an/a
University of Auckland
Assay Description
IC50 is the inhibitor concentration which inhibits 50% of kinase activity that catalyzes the transfer of the terminal phosphate from [gamma-32P] labe...
J Med Chem 43: 3134-47 (2000)
Article DOI: 10.1021/jm000148t
BindingDB Entry DOI: 10.7270/Q2028PQ1
Proto-oncogene tyrosine-protein kinase Src
(Homo sapiens (Human))
BDBM4182
(1,6-naphthyridin-2(1H)-one deriv. 7o | 3-(2,6-Dich...)
Show SMILES Cn1c2cc(Nc3ccncc3)ncc2cc(-c2c(Cl)cccc2Cl)c1=O |(-1.18,-3.43,;-1.18,-1.89,;-2.52,-1.12,;-3.85,-1.95,;-5.18,-1.18,;-6.52,-1.95,;-7.85,-1.18,;-7.85,.36,;-9.18,1.13,;-10.52,.36,;-10.52,-1.18,;-9.18,-1.95,;-5.18,.36,;-3.85,1.13,;-2.52,.42,;-1.18,1.19,;.15,.42,;1.48,1.19,;1.48,2.73,;.15,3.5,;2.82,3.5,;4.15,2.73,;4.15,1.19,;2.82,.42,;2.82,-1.12,;.15,-1.12,;1.48,-1.89,)|
Show InChI InChI=1S/C20H14Cl2N4O/c1-26-17-10-18(25-13-5-7-23-8-6-13)24-11-12(17)9-14(20(26)27)19-15(21)3-2-4-16(19)22/h2-11H,1H3,(H,23,24,25)
n/an/a 550n/an/an/an/an/an/a
University of Auckland
Assay Description
IC50 is the inhibitor concentration which inhibits 50% of kinase activity that catalyzes the transfer of the terminal phosphate from [gamma-32P] labe...
J Med Chem 43: 3134-47 (2000)
Article DOI: 10.1021/jm000148t
BindingDB Entry DOI: 10.7270/Q2028PQ1
Fibroblast growth factor receptor 1
(Homo sapiens (Human))
BDBM4182
(1,6-naphthyridin-2(1H)-one deriv. 7o | 3-(2,6-Dich...)
Show SMILES Cn1c2cc(Nc3ccncc3)ncc2cc(-c2c(Cl)cccc2Cl)c1=O |(-1.18,-3.43,;-1.18,-1.89,;-2.52,-1.12,;-3.85,-1.95,;-5.18,-1.18,;-6.52,-1.95,;-7.85,-1.18,;-7.85,.36,;-9.18,1.13,;-10.52,.36,;-10.52,-1.18,;-9.18,-1.95,;-5.18,.36,;-3.85,1.13,;-2.52,.42,;-1.18,1.19,;.15,.42,;1.48,1.19,;1.48,2.73,;.15,3.5,;2.82,3.5,;4.15,2.73,;4.15,1.19,;2.82,.42,;2.82,-1.12,;.15,-1.12,;1.48,-1.89,)|
Show InChI InChI=1S/C20H14Cl2N4O/c1-26-17-10-18(25-13-5-7-23-8-6-13)24-11-12(17)9-14(20(26)27)19-15(21)3-2-4-16(19)22/h2-11H,1H3,(H,23,24,25)
NCI pathway
Reactome pathway
n/an/a 3.50E+3n/an/an/an/an/an/a
University of Auckland
Assay Description
IC50 is the inhibitor concentration which inhibits 50% of kinase activity that catalyzes the transfer of the terminal phosphate from [gamma-32P] labe...
J Med Chem 43: 3134-47 (2000)
Article DOI: 10.1021/jm000148t
BindingDB Entry DOI: 10.7270/Q2028PQ1