BDBM4186 1,6-naphthyridin-2(1H)-one deriv. 7s::3-(2,6-Dichlorophenyl)-1-methyl-7-[[4-[2-(4-methylpiperazin-1-yl)ethoxy]phenyl]amino]-1,6-naphthyridin-2(1H)-one::3-(2,6-dichlorophenyl)-1-methyl-7-({4-[2-(4-methylpiperazin-1-yl)ethoxy]phenyl}amino)-1,2-dihydro-1,6-naphthyridin-2-one
SMILES: CN1CCN(CCOc2ccc(Nc3cc4n(C)c(=O)c(cc4cn3)-c3c(Cl)cccc3Cl)cc2)CC1
InChI Key: InChIKey=OJWPICIEUSPJKT-UHFFFAOYSA-N
Data: 3 IC50
Activity Spreadsheet -- Enzyme Inhibition Constant Data from BindingDB
Found 3 hits for monomerid = 4186
Trg + Lig
Ki
nM
ΔG°
kcal/mole
IC50
nM
Kd
nM
EC50/IC50
nM
koff
s-1
kon
M-1s-1
pHTemp
°C
Platelet-derived growth factor receptor beta
(Homo sapiens (Human))
BDBM4186
(1,6-naphthyridin-2(1H)-one deriv. 7s | 3-(2,6-Dich...)
Show SMILES CN1CCN(CCOc2ccc(Nc3cc4n(C)c(=O)c(cc4cn3)-c3c(Cl)cccc3Cl)cc2)CC1 |(-13.19,9.6,;-13.19,8.06,;-14.52,7.29,;-14.52,5.75,;-13.19,4.98,;-13.19,3.44,;-11.85,2.67,;-11.85,1.13,;-10.52,.36,;-10.52,-1.18,;-9.18,-1.95,;-7.85,-1.18,;-6.52,-1.95,;-5.18,-1.18,;-3.85,-1.95,;-2.52,-1.12,;-1.18,-1.89,;-1.18,-3.43,;.15,-1.12,;1.48,-1.89,;.15,.42,;-1.18,1.19,;-2.52,.42,;-3.85,1.13,;-5.18,.36,;1.48,1.19,;1.48,2.73,;.15,3.5,;2.82,3.5,;4.15,2.73,;4.15,1.19,;2.82,.42,;2.82,-1.12,;-7.85,.36,;-9.18,1.13,;-11.85,5.75,;-11.85,7.29,)|
Show InChI InChI=1S/C28H29Cl2N5O2/c1-33-10-12-35(13-11-33)14-15-37-21-8-6-20(7-9-21)32-26-17-25-19(18-31-26)16-22(28(36)34(25)2)27-23(29)4-3-5-24(27)30/h3-9,16-18H,10-15H2,1-2H3,(H,31,32)
NCI pathway
Reactome pathway
n/an/a 260n/an/an/an/an/an/a
University of Auckland
Assay Description
IC50 is the inhibitor concentration which inhibits 50% of kinase activity that catalyzes the transfer of the terminal phosphate from [gamma-32P] labe...
J Med Chem 43: 3134-47 (2000)
Article DOI: 10.1021/jm000148t
BindingDB Entry DOI: 10.7270/Q2028PQ1
Proto-oncogene tyrosine-protein kinase Src
(Homo sapiens (Human))
BDBM4186
(1,6-naphthyridin-2(1H)-one deriv. 7s | 3-(2,6-Dich...)
Show SMILES CN1CCN(CCOc2ccc(Nc3cc4n(C)c(=O)c(cc4cn3)-c3c(Cl)cccc3Cl)cc2)CC1 |(-13.19,9.6,;-13.19,8.06,;-14.52,7.29,;-14.52,5.75,;-13.19,4.98,;-13.19,3.44,;-11.85,2.67,;-11.85,1.13,;-10.52,.36,;-10.52,-1.18,;-9.18,-1.95,;-7.85,-1.18,;-6.52,-1.95,;-5.18,-1.18,;-3.85,-1.95,;-2.52,-1.12,;-1.18,-1.89,;-1.18,-3.43,;.15,-1.12,;1.48,-1.89,;.15,.42,;-1.18,1.19,;-2.52,.42,;-3.85,1.13,;-5.18,.36,;1.48,1.19,;1.48,2.73,;.15,3.5,;2.82,3.5,;4.15,2.73,;4.15,1.19,;2.82,.42,;2.82,-1.12,;-7.85,.36,;-9.18,1.13,;-11.85,5.75,;-11.85,7.29,)|
Show InChI InChI=1S/C28H29Cl2N5O2/c1-33-10-12-35(13-11-33)14-15-37-21-8-6-20(7-9-21)32-26-17-25-19(18-31-26)16-22(28(36)34(25)2)27-23(29)4-3-5-24(27)30/h3-9,16-18H,10-15H2,1-2H3,(H,31,32)
n/an/a 16n/an/an/an/an/an/a
University of Auckland
Assay Description
IC50 is the inhibitor concentration which inhibits 50% of kinase activity that catalyzes the transfer of the terminal phosphate from [gamma-32P] labe...
J Med Chem 43: 3134-47 (2000)
Article DOI: 10.1021/jm000148t
BindingDB Entry DOI: 10.7270/Q2028PQ1
Fibroblast growth factor receptor 1
(Homo sapiens (Human))
BDBM4186
(1,6-naphthyridin-2(1H)-one deriv. 7s | 3-(2,6-Dich...)
Show SMILES CN1CCN(CCOc2ccc(Nc3cc4n(C)c(=O)c(cc4cn3)-c3c(Cl)cccc3Cl)cc2)CC1 |(-13.19,9.6,;-13.19,8.06,;-14.52,7.29,;-14.52,5.75,;-13.19,4.98,;-13.19,3.44,;-11.85,2.67,;-11.85,1.13,;-10.52,.36,;-10.52,-1.18,;-9.18,-1.95,;-7.85,-1.18,;-6.52,-1.95,;-5.18,-1.18,;-3.85,-1.95,;-2.52,-1.12,;-1.18,-1.89,;-1.18,-3.43,;.15,-1.12,;1.48,-1.89,;.15,.42,;-1.18,1.19,;-2.52,.42,;-3.85,1.13,;-5.18,.36,;1.48,1.19,;1.48,2.73,;.15,3.5,;2.82,3.5,;4.15,2.73,;4.15,1.19,;2.82,.42,;2.82,-1.12,;-7.85,.36,;-9.18,1.13,;-11.85,5.75,;-11.85,7.29,)|
Show InChI InChI=1S/C28H29Cl2N5O2/c1-33-10-12-35(13-11-33)14-15-37-21-8-6-20(7-9-21)32-26-17-25-19(18-31-26)16-22(28(36)34(25)2)27-23(29)4-3-5-24(27)30/h3-9,16-18H,10-15H2,1-2H3,(H,31,32)
NCI pathway
Reactome pathway
n/an/a 210n/an/an/an/an/an/a
University of Auckland
Assay Description
IC50 is the inhibitor concentration which inhibits 50% of kinase activity that catalyzes the transfer of the terminal phosphate from [gamma-32P] labe...
J Med Chem 43: 3134-47 (2000)
Article DOI: 10.1021/jm000148t
BindingDB Entry DOI: 10.7270/Q2028PQ1