BDBM4188 1,6-naphthyridin-2(1H)-one deriv. 7u::3-(2,6-Dichlorophenyl)-1-methyl-7-[[4-(4-methylpiperazin-1-yl)phenyl]amino]-1,6-naphthyridin-2(1H)-one::3-(2,6-dichlorophenyl)-1-methyl-7-{[4-(4-methylpiperazin-1-yl)phenyl]amino}-1,2-dihydro-1,6-naphthyridin-2-one
SMILES: CN1CCN(CC1)c1ccc(Nc2cc3n(C)c(=O)c(cc3cn2)-c2c(Cl)cccc2Cl)cc1
InChI Key: InChIKey=GMKQAXFNIGTRDK-UHFFFAOYSA-N
Data: 3 IC50
Activity Spreadsheet -- Enzyme Inhibition Constant Data from BindingDB
Found 3 hits for monomerid = 4188
Trg + Lig
Ki
nM
ΔG°
kcal/mole
IC50
nM
Kd
nM
EC50/IC50
nM
koff
s-1
kon
M-1s-1
pHTemp
°C
Platelet-derived growth factor receptor beta
(Homo sapiens (Human))
BDBM4188
(1,6-naphthyridin-2(1H)-one deriv. 7u | 3-(2,6-Dich...)
Show SMILES CN1CCN(CC1)c1ccc(Nc2cc3n(C)c(=O)c(cc3cn2)-c2c(Cl)cccc2Cl)cc1 |(-15.85,3.44,;-14.52,2.67,;-13.19,3.44,;-11.85,2.67,;-11.85,1.13,;-13.19,.36,;-14.52,1.13,;-10.52,.36,;-10.52,-1.18,;-9.18,-1.95,;-7.85,-1.18,;-6.52,-1.95,;-5.18,-1.18,;-3.85,-1.95,;-2.52,-1.12,;-1.18,-1.89,;-1.18,-3.43,;.15,-1.12,;1.48,-1.89,;.15,.42,;-1.18,1.19,;-2.52,.42,;-3.85,1.13,;-5.18,.36,;1.48,1.19,;1.48,2.73,;.15,3.5,;2.82,3.5,;4.15,2.73,;4.15,1.19,;2.82,.42,;2.82,-1.12,;-7.85,.36,;-9.18,1.13,)|
Show InChI InChI=1S/C26H25Cl2N5O/c1-31-10-12-33(13-11-31)19-8-6-18(7-9-19)30-24-15-23-17(16-29-24)14-20(26(34)32(23)2)25-21(27)4-3-5-22(25)28/h3-9,14-16H,10-13H2,1-2H3,(H,29,30)
NCI pathway
Reactome pathway
n/an/a 260n/an/an/an/an/an/a
University of Auckland
Assay Description
IC50 is the inhibitor concentration which inhibits 50% of kinase activity that catalyzes the transfer of the terminal phosphate from [gamma-32P] labe...
J Med Chem 43: 3134-47 (2000)
Article DOI: 10.1021/jm000148t
BindingDB Entry DOI: 10.7270/Q2028PQ1
Proto-oncogene tyrosine-protein kinase Src
(Homo sapiens (Human))
BDBM4188
(1,6-naphthyridin-2(1H)-one deriv. 7u | 3-(2,6-Dich...)
Show SMILES CN1CCN(CC1)c1ccc(Nc2cc3n(C)c(=O)c(cc3cn2)-c2c(Cl)cccc2Cl)cc1 |(-15.85,3.44,;-14.52,2.67,;-13.19,3.44,;-11.85,2.67,;-11.85,1.13,;-13.19,.36,;-14.52,1.13,;-10.52,.36,;-10.52,-1.18,;-9.18,-1.95,;-7.85,-1.18,;-6.52,-1.95,;-5.18,-1.18,;-3.85,-1.95,;-2.52,-1.12,;-1.18,-1.89,;-1.18,-3.43,;.15,-1.12,;1.48,-1.89,;.15,.42,;-1.18,1.19,;-2.52,.42,;-3.85,1.13,;-5.18,.36,;1.48,1.19,;1.48,2.73,;.15,3.5,;2.82,3.5,;4.15,2.73,;4.15,1.19,;2.82,.42,;2.82,-1.12,;-7.85,.36,;-9.18,1.13,)|
Show InChI InChI=1S/C26H25Cl2N5O/c1-31-10-12-33(13-11-31)19-8-6-18(7-9-19)30-24-15-23-17(16-29-24)14-20(26(34)32(23)2)25-21(27)4-3-5-22(25)28/h3-9,14-16H,10-13H2,1-2H3,(H,29,30)
n/an/a 23n/an/an/an/an/an/a
University of Auckland
Assay Description
IC50 is the inhibitor concentration which inhibits 50% of kinase activity that catalyzes the transfer of the terminal phosphate from [gamma-32P] labe...
J Med Chem 43: 3134-47 (2000)
Article DOI: 10.1021/jm000148t
BindingDB Entry DOI: 10.7270/Q2028PQ1
Fibroblast growth factor receptor 1
(Homo sapiens (Human))
BDBM4188
(1,6-naphthyridin-2(1H)-one deriv. 7u | 3-(2,6-Dich...)
Show SMILES CN1CCN(CC1)c1ccc(Nc2cc3n(C)c(=O)c(cc3cn2)-c2c(Cl)cccc2Cl)cc1 |(-15.85,3.44,;-14.52,2.67,;-13.19,3.44,;-11.85,2.67,;-11.85,1.13,;-13.19,.36,;-14.52,1.13,;-10.52,.36,;-10.52,-1.18,;-9.18,-1.95,;-7.85,-1.18,;-6.52,-1.95,;-5.18,-1.18,;-3.85,-1.95,;-2.52,-1.12,;-1.18,-1.89,;-1.18,-3.43,;.15,-1.12,;1.48,-1.89,;.15,.42,;-1.18,1.19,;-2.52,.42,;-3.85,1.13,;-5.18,.36,;1.48,1.19,;1.48,2.73,;.15,3.5,;2.82,3.5,;4.15,2.73,;4.15,1.19,;2.82,.42,;2.82,-1.12,;-7.85,.36,;-9.18,1.13,)|
Show InChI InChI=1S/C26H25Cl2N5O/c1-31-10-12-33(13-11-31)19-8-6-18(7-9-19)30-24-15-23-17(16-29-24)14-20(26(34)32(23)2)25-21(27)4-3-5-22(25)28/h3-9,14-16H,10-13H2,1-2H3,(H,29,30)
NCI pathway
Reactome pathway
n/an/a 42n/an/an/an/an/an/a
University of Auckland
Assay Description
IC50 is the inhibitor concentration which inhibits 50% of kinase activity that catalyzes the transfer of the terminal phosphate from [gamma-32P] labe...
J Med Chem 43: 3134-47 (2000)
Article DOI: 10.1021/jm000148t
BindingDB Entry DOI: 10.7270/Q2028PQ1