BDBM41986 6-[(3,4-dimethoxyphenyl)-(4-morpholinyl)methyl]-1,3-benzodioxol-5-ol::6-[(3,4-dimethoxyphenyl)-morpholin-4-yl-methyl]-1,3-benzodioxol-5-ol::6-[(3,4-dimethoxyphenyl)-morpholin-4-ylmethyl]-1,3-benzodioxol-5-ol::6-[(3,4-dimethoxyphenyl)-morpholino-methyl]sesamol::cid_339886
SMILES: COc1ccc(cc1OC)C(N1CCOCC1)c1cc2OCOc2cc1O
InChI Key: InChIKey=POUGOEFZYGQTHG-UHFFFAOYSA-N
Data: 1 IC50
Activity Spreadsheet -- Enzyme Inhibition Constant Data from BindingDB
Found 2 hits for monomerid = 41986
Trg + Lig
Ki
nM
ΔG°
kcal/mole
IC50
nM
Kd
nM
EC50/IC50
nM
koff
s-1
kon
M-1s-1
pHTemp
°C
Protein disulfide-isomerase
(Homo sapiens (Human))
BDBM41986
(6-[(3,4-dimethoxyphenyl)-(4-morpholinyl)methyl]-1,...)
Show SMILES COc1ccc(cc1OC)C(N1CCOCC1)c1cc2OCOc2cc1O
Show InChI InChI=1S/C20H23NO6/c1-23-16-4-3-13(9-17(16)24-2)20(21-5-7-25-8-6-21)14-10-18-19(11-15(14)22)27-12-26-18/h3-4,9-11,20,22H,5-8,12H2,1-2H3
Reactome pathway
n/an/a 300n/an/an/an/an/an/a
TBA
Citation and Details
Mothers against decapentaplegic homolog 3
(Homo sapiens (Human))
BDBM41986
(6-[(3,4-dimethoxyphenyl)-(4-morpholinyl)methyl]-1,...)
Show SMILES COc1ccc(cc1OC)C(N1CCOCC1)c1cc2OCOc2cc1O
Show InChI InChI=1S/C20H23NO6/c1-23-16-4-3-13(9-17(16)24-2)20(21-5-7-25-8-6-21)14-10-18-19(11-15(14)22)27-12-26-18/h3-4,9-11,20,22H,5-8,12H2,1-2H3
Reactome pathway
PCBioAssay
n/an/a 1.22E+4n/an/an/an/an/an/a
Emory University Molecular Libraries Screening Center
Curated by PubChem BioAssay
Assay Description
NIH Molecular Libraries Screening Centers Network [MLSCN] Emory Chemical Biology Discovery Center in MLSCN Assay provider: F.M. Hoffmann, University ...
PubChem Bioassay (2008)
BindingDB Entry DOI: 10.7270/Q21R6NZ6