BDBM42000 7-methyl-2-(3,4,5-trihydroxy-6-keto-xanthen-9-yl)bicyclo[2.2.1]hept-5-ene-3-carboxylic acid::7-methyl-2-(3,4,5-trihydroxy-6-oxo-9-xanthenyl)-3-bicyclo[2.2.1]hept-5-enecarboxylic acid::7-methyl-2-(3,4,5-trihydroxy-6-oxoxanthen-9-yl)bicyclo[2.2.1]hept-5-ene-3-carboxylic acid::7-methyl-2-[3,4,5-tris(oxidanyl)-6-oxidanylidene-xanthen-9-yl]bicyclo[2.2.1]hept-5-ene-3-carboxylic acid::MLS-0111619.0001::cid_274125
SMILES: [H]C12C=CC([H])(C1C)C(C2C(O)=O)c1c2ccc(O)c(O)c2oc2c(O)c(=O)ccc12
InChI Key: InChIKey=BSAMRWOMXJWVCE-UHFFFAOYSA-N
Data: 2 IC50
Activity Spreadsheet -- Enzyme Inhibition Constant Data from BindingDB
Found 2 hits for monomerid = 42000
Trg + Lig
Ki
nM
ΔG°
kcal/mole
IC50
nM
Kd
nM
EC50/IC50
nM
koff
s-1
kon
M-1s-1
pHTemp
°C
heat shock 70kDa protein 8 isoform 2
(Homo sapiens (Human))
BDBM42000
(7-methyl-2-(3,4,5-trihydroxy-6-keto-xanthen-9-yl)b...)
Show SMILES [H]C12C=CC([H])(C1C)C(C2C(O)=O)c1c2ccc(O)c(O)c2oc2c(O)c(=O)ccc12 |c:2,TLB:13:8:6:3.2,THB:10:9:6:3.2|
Show InChI InChI=1S/C22H18O7/c1-8-9-2-3-10(8)17(22(27)28)16(9)15-11-4-6-13(23)18(25)20(11)29-21-12(15)5-7-14(24)19(21)26/h2-10,16-17,23,25-26H,1H3,(H,27,28)
Reactome pathway
PCBioAssay
n/an/a 5.58E+3n/an/an/an/an/an/a
Sanford-Burnham Center for Chemical Genomics
Curated by PubChem BioAssay
Assay Description
Data Source: Sanford-Burnham Center for Chemical Genomics (SBCCG) Source Affiliation: Sanford-Burnham Medical Research Institute (SBMRI, San Diego, C...
PubChem Bioassay (2008)
BindingDB Entry DOI: 10.7270/Q20G3HKD
Heat Shock 70kDa Protein 1
(Homo sapiens (Human))
BDBM42000
(7-methyl-2-(3,4,5-trihydroxy-6-keto-xanthen-9-yl)b...)
Show SMILES [H]C12C=CC([H])(C1C)C(C2C(O)=O)c1c2ccc(O)c(O)c2oc2c(O)c(=O)ccc12 |c:2,TLB:13:8:6:3.2,THB:10:9:6:3.2|
Show InChI InChI=1S/C22H18O7/c1-8-9-2-3-10(8)17(22(27)28)16(9)15-11-4-6-13(23)18(25)20(11)29-21-12(15)5-7-14(24)19(21)26/h2-10,16-17,23,25-26H,1H3,(H,27,28)
PCBioAssay
n/an/a 634n/an/an/an/an/an/a
Burnham Center for Chemical Genomics
Curated by PubChem BioAssay
Assay Description
Sanford-Burnham Center for Chemical Genomics (SBCCG) Sanford-Burnham Medical Research Institute (SBMRI, San Diego, CA) NIH Molecular Libraries Screen...
PubChem Bioassay (2008)
BindingDB Entry DOI: 10.7270/Q2S75DRW