BDBM4213 6-(2,6-dichlorophenyl)-8-methyl-2-{[4-(morpholin-4-yl)phenyl]amino}-7H,8H-pyrido[2,3-d]pyrimidin-7-one::PD173952
SMILES: Cn1c2nc(Nc3ccc(cc3)N3CCOCC3)ncc2cc(-c2c(Cl)cccc2Cl)c1=O
InChI Key: InChIKey=XZEJMVDCQZRHLN-UHFFFAOYSA-N
Data: 5 KI  11 IC50
Activity Spreadsheet -- Enzyme Inhibition Constant Data from BindingDB
Found 16 hits for monomerid = 4213
Trg + Lig
Ki
nM
ΔG°
kcal/mole
IC50
nM
Kd
nM
EC50/IC50
nM
koff
s-1
kon
M-1s-1
pHTemp
°C
Tyrosine- and threonine-specific cdc2-inhibitory kinase
(Homo sapiens (Human))
BDBM4213
(6-(2,6-dichlorophenyl)-8-methyl-2-{[4-(morpholin-4...)
Show SMILES Cn1c2nc(Nc3ccc(cc3)N3CCOCC3)ncc2cc(-c2c(Cl)cccc2Cl)c1=O |(-.52,-2.15,;-.52,-.61,;-1.86,.16,;-3.19,-.61,;-4.53,.16,;-5.86,-.61,;-7.19,.16,;-8.55,-.56,;-9.86,.26,;-9.8,1.8,;-8.44,2.52,;-7.14,1.7,;-11.11,2.62,;-11.11,4.16,;-12.44,4.93,;-13.78,4.16,;-13.78,2.62,;-12.44,1.85,;-4.53,1.7,;-3.19,2.47,;-1.86,1.7,;-.52,2.47,;.81,1.7,;2.14,2.47,;2.14,4.01,;.81,4.78,;3.48,4.78,;4.81,4.01,;4.81,2.47,;3.48,1.7,;3.48,.16,;.81,.16,;2.14,-.61,)|
Show InChI InChI=1S/C24H21Cl2N5O2/c1-30-22-15(13-18(23(30)32)21-19(25)3-2-4-20(21)26)14-27-24(29-22)28-16-5-7-17(8-6-16)31-9-11-33-12-10-31/h2-8,13-14H,9-12H2,1H3,(H,27,28,29)
Reactome pathway
2.30n/an/an/an/an/an/an/an/a
Martin-Luther-University Halle-Wittenberg
Curated by ChEMBL
Assay Description
Displacement of (6-FAM)KI(pY)VV from full length PKMYT1 (unknown origin) by fluorescence polarization immuno assay
Eur J Med Chem 161: 479-492 (2019)
Article DOI: 10.1016/j.ejmech.2018.10.050
Tyrosine- and threonine-specific cdc2-inhibitory kinase
(Homo sapiens (Human))
BDBM4213
(6-(2,6-dichlorophenyl)-8-methyl-2-{[4-(morpholin-4...)
Show SMILES Cn1c2nc(Nc3ccc(cc3)N3CCOCC3)ncc2cc(-c2c(Cl)cccc2Cl)c1=O |(-.52,-2.15,;-.52,-.61,;-1.86,.16,;-3.19,-.61,;-4.53,.16,;-5.86,-.61,;-7.19,.16,;-8.55,-.56,;-9.86,.26,;-9.8,1.8,;-8.44,2.52,;-7.14,1.7,;-11.11,2.62,;-11.11,4.16,;-12.44,4.93,;-13.78,4.16,;-13.78,2.62,;-12.44,1.85,;-4.53,1.7,;-3.19,2.47,;-1.86,1.7,;-.52,2.47,;.81,1.7,;2.14,2.47,;2.14,4.01,;.81,4.78,;3.48,4.78,;4.81,4.01,;4.81,2.47,;3.48,1.7,;3.48,.16,;.81,.16,;2.14,-.61,)|
Show InChI InChI=1S/C24H21Cl2N5O2/c1-30-22-15(13-18(23(30)32)21-19(25)3-2-4-20(21)26)14-27-24(29-22)28-16-5-7-17(8-6-16)31-9-11-33-12-10-31/h2-8,13-14H,9-12H2,1H3,(H,27,28,29)
Reactome pathway
2.30n/an/an/an/an/an/an/an/a
Martin-Luther-University Halle-Wittenberg
Curated by ChEMBL
Assay Description
Inhibition of human full length PKMYT1 expressed in HEK293 cells using EFS (247 to 259 residues) as substrate after 1 hr by fluorescence polarization...
Bioorg Med Chem 26: 4014-4024 (2018)
Article DOI: 10.1016/j.bmc.2018.06.027
BindingDB Entry DOI: 10.7270/Q29Z97K0
Tyrosine- and threonine-specific cdc2-inhibitory kinase
(Homo sapiens (Human))
BDBM4213
(6-(2,6-dichlorophenyl)-8-methyl-2-{[4-(morpholin-4...)
Show SMILES Cn1c2nc(Nc3ccc(cc3)N3CCOCC3)ncc2cc(-c2c(Cl)cccc2Cl)c1=O |(-.52,-2.15,;-.52,-.61,;-1.86,.16,;-3.19,-.61,;-4.53,.16,;-5.86,-.61,;-7.19,.16,;-8.55,-.56,;-9.86,.26,;-9.8,1.8,;-8.44,2.52,;-7.14,1.7,;-11.11,2.62,;-11.11,4.16,;-12.44,4.93,;-13.78,4.16,;-13.78,2.62,;-12.44,1.85,;-4.53,1.7,;-3.19,2.47,;-1.86,1.7,;-.52,2.47,;.81,1.7,;2.14,2.47,;2.14,4.01,;.81,4.78,;3.48,4.78,;4.81,4.01,;4.81,2.47,;3.48,1.7,;3.48,.16,;.81,.16,;2.14,-.61,)|
Show InChI InChI=1S/C24H21Cl2N5O2/c1-30-22-15(13-18(23(30)32)21-19(25)3-2-4-20(21)26)14-27-24(29-22)28-16-5-7-17(8-6-16)31-9-11-33-12-10-31/h2-8,13-14H,9-12H2,1H3,(H,27,28,29)
Reactome pathway
8.10n/an/an/an/an/an/an/an/a
Martin-Luther-University Halle-Wittenberg
Curated by ChEMBL
Assay Description
Displacement of (6-FAM)KI(pY)VV from PKMYT1 kinase domain (unknown origin) by fluorescence polarization binding assay
Eur J Med Chem 161: 479-492 (2019)
Article DOI: 10.1016/j.ejmech.2018.10.050
Tyrosine- and threonine-specific cdc2-inhibitory kinase
(Homo sapiens (Human))
BDBM4213
(6-(2,6-dichlorophenyl)-8-methyl-2-{[4-(morpholin-4...)
Show SMILES Cn1c2nc(Nc3ccc(cc3)N3CCOCC3)ncc2cc(-c2c(Cl)cccc2Cl)c1=O |(-.52,-2.15,;-.52,-.61,;-1.86,.16,;-3.19,-.61,;-4.53,.16,;-5.86,-.61,;-7.19,.16,;-8.55,-.56,;-9.86,.26,;-9.8,1.8,;-8.44,2.52,;-7.14,1.7,;-11.11,2.62,;-11.11,4.16,;-12.44,4.93,;-13.78,4.16,;-13.78,2.62,;-12.44,1.85,;-4.53,1.7,;-3.19,2.47,;-1.86,1.7,;-.52,2.47,;.81,1.7,;2.14,2.47,;2.14,4.01,;.81,4.78,;3.48,4.78,;4.81,4.01,;4.81,2.47,;3.48,1.7,;3.48,.16,;.81,.16,;2.14,-.61,)|
Show InChI InChI=1S/C24H21Cl2N5O2/c1-30-22-15(13-18(23(30)32)21-19(25)3-2-4-20(21)26)14-27-24(29-22)28-16-5-7-17(8-6-16)31-9-11-33-12-10-31/h2-8,13-14H,9-12H2,1H3,(H,27,28,29)
Reactome pathway
8.10n/an/an/an/an/an/an/an/a
Martin-Luther-University Halle-Wittenberg
Curated by ChEMBL
Assay Description
Displacement of (6-FAM)KI(pY)VV from PKMYT1 kinase domain (unknown origin) by fluorescence polarization binding assay
Eur J Med Chem 161: 479-492 (2019)
Article DOI: 10.1016/j.ejmech.2018.10.050
Tyrosine- and threonine-specific cdc2-inhibitory kinase
(Homo sapiens (Human))
BDBM4213
(6-(2,6-dichlorophenyl)-8-methyl-2-{[4-(morpholin-4...)
Show SMILES Cn1c2nc(Nc3ccc(cc3)N3CCOCC3)ncc2cc(-c2c(Cl)cccc2Cl)c1=O |(-.52,-2.15,;-.52,-.61,;-1.86,.16,;-3.19,-.61,;-4.53,.16,;-5.86,-.61,;-7.19,.16,;-8.55,-.56,;-9.86,.26,;-9.8,1.8,;-8.44,2.52,;-7.14,1.7,;-11.11,2.62,;-11.11,4.16,;-12.44,4.93,;-13.78,4.16,;-13.78,2.62,;-12.44,1.85,;-4.53,1.7,;-3.19,2.47,;-1.86,1.7,;-.52,2.47,;.81,1.7,;2.14,2.47,;2.14,4.01,;.81,4.78,;3.48,4.78,;4.81,4.01,;4.81,2.47,;3.48,1.7,;3.48,.16,;.81,.16,;2.14,-.61,)|
Show InChI InChI=1S/C24H21Cl2N5O2/c1-30-22-15(13-18(23(30)32)21-19(25)3-2-4-20(21)26)14-27-24(29-22)28-16-5-7-17(8-6-16)31-9-11-33-12-10-31/h2-8,13-14H,9-12H2,1H3,(H,27,28,29)
Reactome pathway
8.10n/an/an/an/an/an/an/an/a
Martin-Luther-University Halle-Wittenberg
Curated by ChEMBL
Assay Description
Inhibition of N-[3',6'-dihydroxy-3-oxo-3H-spiro(2-benzofuran-1,9'-xanthen)-5-yl]-N'-[2-(4-{4-[N-(2-chloro-6-methylphenyl)-5-carboxamido]-thiazol-2-yl...
Bioorg Med Chem 26: 4014-4024 (2018)
Article DOI: 10.1016/j.bmc.2018.06.027
BindingDB Entry DOI: 10.7270/Q29Z97K0
Proto-oncogene tyrosine-protein kinase Src
(Homo sapiens (Human))
BDBM4213
(6-(2,6-dichlorophenyl)-8-methyl-2-{[4-(morpholin-4...)
Show SMILES Cn1c2nc(Nc3ccc(cc3)N3CCOCC3)ncc2cc(-c2c(Cl)cccc2Cl)c1=O |(-.52,-2.15,;-.52,-.61,;-1.86,.16,;-3.19,-.61,;-4.53,.16,;-5.86,-.61,;-7.19,.16,;-8.55,-.56,;-9.86,.26,;-9.8,1.8,;-8.44,2.52,;-7.14,1.7,;-11.11,2.62,;-11.11,4.16,;-12.44,4.93,;-13.78,4.16,;-13.78,2.62,;-12.44,1.85,;-4.53,1.7,;-3.19,2.47,;-1.86,1.7,;-.52,2.47,;.81,1.7,;2.14,2.47,;2.14,4.01,;.81,4.78,;3.48,4.78,;4.81,4.01,;4.81,2.47,;3.48,1.7,;3.48,.16,;.81,.16,;2.14,-.61,)|
Show InChI InChI=1S/C24H21Cl2N5O2/c1-30-22-15(13-18(23(30)32)21-19(25)3-2-4-20(21)26)14-27-24(29-22)28-16-5-7-17(8-6-16)31-9-11-33-12-10-31/h2-8,13-14H,9-12H2,1H3,(H,27,28,29)
n/an/a 8n/an/an/an/an/an/a
University of Auckland
Assay Description
IC50 is the inhibitor concentration which inhibits 50% of kinase activity that catalyzes the transfer of the terminal phosphate from [gamma-32P] labe...
J Med Chem 43: 3134-47 (2000)
Article DOI: 10.1021/jm000148t
BindingDB Entry DOI: 10.7270/Q2028PQ1
Tyrosine- and threonine-specific cdc2-inhibitory kinase
(Homo sapiens (Human))
BDBM4213
(6-(2,6-dichlorophenyl)-8-methyl-2-{[4-(morpholin-4...)
Show SMILES Cn1c2nc(Nc3ccc(cc3)N3CCOCC3)ncc2cc(-c2c(Cl)cccc2Cl)c1=O |(-.52,-2.15,;-.52,-.61,;-1.86,.16,;-3.19,-.61,;-4.53,.16,;-5.86,-.61,;-7.19,.16,;-8.55,-.56,;-9.86,.26,;-9.8,1.8,;-8.44,2.52,;-7.14,1.7,;-11.11,2.62,;-11.11,4.16,;-12.44,4.93,;-13.78,4.16,;-13.78,2.62,;-12.44,1.85,;-4.53,1.7,;-3.19,2.47,;-1.86,1.7,;-.52,2.47,;.81,1.7,;2.14,2.47,;2.14,4.01,;.81,4.78,;3.48,4.78,;4.81,4.01,;4.81,2.47,;3.48,1.7,;3.48,.16,;.81,.16,;2.14,-.61,)|
Show InChI InChI=1S/C24H21Cl2N5O2/c1-30-22-15(13-18(23(30)32)21-19(25)3-2-4-20(21)26)14-27-24(29-22)28-16-5-7-17(8-6-16)31-9-11-33-12-10-31/h2-8,13-14H,9-12H2,1H3,(H,27,28,29)
Reactome pathway
n/an/a 24n/an/an/an/an/an/a
Martin-Luther-University Halle-Wittenberg
Curated by ChEMBL
Assay Description
Inhibition of human full length PKMYT1 expressed in HEK293 cells using EFS (247 to 259 residues) as substrate after 1 hr by fluorescence polarization...
Bioorg Med Chem 26: 4014-4024 (2018)
Article DOI: 10.1016/j.bmc.2018.06.027
BindingDB Entry DOI: 10.7270/Q29Z97K0
Tyrosine- and threonine-specific cdc2-inhibitory kinase
(Homo sapiens (Human))
BDBM4213
(6-(2,6-dichlorophenyl)-8-methyl-2-{[4-(morpholin-4...)
Show SMILES Cn1c2nc(Nc3ccc(cc3)N3CCOCC3)ncc2cc(-c2c(Cl)cccc2Cl)c1=O |(-.52,-2.15,;-.52,-.61,;-1.86,.16,;-3.19,-.61,;-4.53,.16,;-5.86,-.61,;-7.19,.16,;-8.55,-.56,;-9.86,.26,;-9.8,1.8,;-8.44,2.52,;-7.14,1.7,;-11.11,2.62,;-11.11,4.16,;-12.44,4.93,;-13.78,4.16,;-13.78,2.62,;-12.44,1.85,;-4.53,1.7,;-3.19,2.47,;-1.86,1.7,;-.52,2.47,;.81,1.7,;2.14,2.47,;2.14,4.01,;.81,4.78,;3.48,4.78,;4.81,4.01,;4.81,2.47,;3.48,1.7,;3.48,.16,;.81,.16,;2.14,-.61,)|
Show InChI InChI=1S/C24H21Cl2N5O2/c1-30-22-15(13-18(23(30)32)21-19(25)3-2-4-20(21)26)14-27-24(29-22)28-16-5-7-17(8-6-16)31-9-11-33-12-10-31/h2-8,13-14H,9-12H2,1H3,(H,27,28,29)
Reactome pathway
n/an/a 55n/an/an/an/an/an/a
Martin-Luther-University Halle-Wittenberg
Curated by ChEMBL
Assay Description
Inhibition of N-[3',6'-dihydroxy-3-oxo-3H-spiro(2-benzofuran-1,9'-xanthen)-5-yl]-N'-[2-(4-{4-[N-(2-chloro-6-methylphenyl)-5-carboxamido]-thiazol-2-yl...
Bioorg Med Chem 26: 4014-4024 (2018)
Article DOI: 10.1016/j.bmc.2018.06.027
BindingDB Entry DOI: 10.7270/Q29Z97K0
Tyrosine- and threonine-specific cdc2-inhibitory kinase
(Homo sapiens (Human))
BDBM4213
(6-(2,6-dichlorophenyl)-8-methyl-2-{[4-(morpholin-4...)
Show SMILES Cn1c2nc(Nc3ccc(cc3)N3CCOCC3)ncc2cc(-c2c(Cl)cccc2Cl)c1=O |(-.52,-2.15,;-.52,-.61,;-1.86,.16,;-3.19,-.61,;-4.53,.16,;-5.86,-.61,;-7.19,.16,;-8.55,-.56,;-9.86,.26,;-9.8,1.8,;-8.44,2.52,;-7.14,1.7,;-11.11,2.62,;-11.11,4.16,;-12.44,4.93,;-13.78,4.16,;-13.78,2.62,;-12.44,1.85,;-4.53,1.7,;-3.19,2.47,;-1.86,1.7,;-.52,2.47,;.81,1.7,;2.14,2.47,;2.14,4.01,;.81,4.78,;3.48,4.78,;4.81,4.01,;4.81,2.47,;3.48,1.7,;3.48,.16,;.81,.16,;2.14,-.61,)|
Show InChI InChI=1S/C24H21Cl2N5O2/c1-30-22-15(13-18(23(30)32)21-19(25)3-2-4-20(21)26)14-27-24(29-22)28-16-5-7-17(8-6-16)31-9-11-33-12-10-31/h2-8,13-14H,9-12H2,1H3,(H,27,28,29)
Reactome pathway
n/an/a 24n/an/an/an/an/an/a
Martin-Luther-University Halle-Wittenberg
Curated by ChEMBL
Assay Description
Displacement of (6-FAM)KI(pY)VV from full length PKMYT1 (unknown origin) by fluorescence polarization immuno assay
Eur J Med Chem 161: 479-492 (2019)
Article DOI: 10.1016/j.ejmech.2018.10.050
Tyrosine- and threonine-specific cdc2-inhibitory kinase
(Homo sapiens (Human))
BDBM4213
(6-(2,6-dichlorophenyl)-8-methyl-2-{[4-(morpholin-4...)
Show SMILES Cn1c2nc(Nc3ccc(cc3)N3CCOCC3)ncc2cc(-c2c(Cl)cccc2Cl)c1=O |(-.52,-2.15,;-.52,-.61,;-1.86,.16,;-3.19,-.61,;-4.53,.16,;-5.86,-.61,;-7.19,.16,;-8.55,-.56,;-9.86,.26,;-9.8,1.8,;-8.44,2.52,;-7.14,1.7,;-11.11,2.62,;-11.11,4.16,;-12.44,4.93,;-13.78,4.16,;-13.78,2.62,;-12.44,1.85,;-4.53,1.7,;-3.19,2.47,;-1.86,1.7,;-.52,2.47,;.81,1.7,;2.14,2.47,;2.14,4.01,;.81,4.78,;3.48,4.78,;4.81,4.01,;4.81,2.47,;3.48,1.7,;3.48,.16,;.81,.16,;2.14,-.61,)|
Show InChI InChI=1S/C24H21Cl2N5O2/c1-30-22-15(13-18(23(30)32)21-19(25)3-2-4-20(21)26)14-27-24(29-22)28-16-5-7-17(8-6-16)31-9-11-33-12-10-31/h2-8,13-14H,9-12H2,1H3,(H,27,28,29)
Reactome pathway
n/an/a 55n/an/an/an/an/an/a
Martin-Luther-University Halle-Wittenberg
Curated by ChEMBL
Assay Description
Displacement of (6-FAM)KI(pY)VV from PKMYT1 kinase domain (unknown origin) by fluorescence polarization binding assay
Eur J Med Chem 161: 479-492 (2019)
Article DOI: 10.1016/j.ejmech.2018.10.050
Fibroblast growth factor receptor 1
(Homo sapiens (Human))
BDBM4213
(6-(2,6-dichlorophenyl)-8-methyl-2-{[4-(morpholin-4...)
Show SMILES Cn1c2nc(Nc3ccc(cc3)N3CCOCC3)ncc2cc(-c2c(Cl)cccc2Cl)c1=O |(-.52,-2.15,;-.52,-.61,;-1.86,.16,;-3.19,-.61,;-4.53,.16,;-5.86,-.61,;-7.19,.16,;-8.55,-.56,;-9.86,.26,;-9.8,1.8,;-8.44,2.52,;-7.14,1.7,;-11.11,2.62,;-11.11,4.16,;-12.44,4.93,;-13.78,4.16,;-13.78,2.62,;-12.44,1.85,;-4.53,1.7,;-3.19,2.47,;-1.86,1.7,;-.52,2.47,;.81,1.7,;2.14,2.47,;2.14,4.01,;.81,4.78,;3.48,4.78,;4.81,4.01,;4.81,2.47,;3.48,1.7,;3.48,.16,;.81,.16,;2.14,-.61,)|
Show InChI InChI=1S/C24H21Cl2N5O2/c1-30-22-15(13-18(23(30)32)21-19(25)3-2-4-20(21)26)14-27-24(29-22)28-16-5-7-17(8-6-16)31-9-11-33-12-10-31/h2-8,13-14H,9-12H2,1H3,(H,27,28,29)
NCI pathway
Reactome pathway
n/an/a 100n/an/an/an/an/an/a
University of Auckland
Assay Description
IC50 is the inhibitor concentration which inhibits 50% of kinase activity that catalyzes the transfer of the terminal phosphate from [gamma-32P] labe...
J Med Chem 43: 3134-47 (2000)
Article DOI: 10.1021/jm000148t
BindingDB Entry DOI: 10.7270/Q2028PQ1
Platelet-derived growth factor receptor beta
(Homo sapiens (Human))
BDBM4213
(6-(2,6-dichlorophenyl)-8-methyl-2-{[4-(morpholin-4...)
Show SMILES Cn1c2nc(Nc3ccc(cc3)N3CCOCC3)ncc2cc(-c2c(Cl)cccc2Cl)c1=O |(-.52,-2.15,;-.52,-.61,;-1.86,.16,;-3.19,-.61,;-4.53,.16,;-5.86,-.61,;-7.19,.16,;-8.55,-.56,;-9.86,.26,;-9.8,1.8,;-8.44,2.52,;-7.14,1.7,;-11.11,2.62,;-11.11,4.16,;-12.44,4.93,;-13.78,4.16,;-13.78,2.62,;-12.44,1.85,;-4.53,1.7,;-3.19,2.47,;-1.86,1.7,;-.52,2.47,;.81,1.7,;2.14,2.47,;2.14,4.01,;.81,4.78,;3.48,4.78,;4.81,4.01,;4.81,2.47,;3.48,1.7,;3.48,.16,;.81,.16,;2.14,-.61,)|
Show InChI InChI=1S/C24H21Cl2N5O2/c1-30-22-15(13-18(23(30)32)21-19(25)3-2-4-20(21)26)14-27-24(29-22)28-16-5-7-17(8-6-16)31-9-11-33-12-10-31/h2-8,13-14H,9-12H2,1H3,(H,27,28,29)
NCI pathway
Reactome pathway
n/an/a 640n/an/an/an/an/an/a
University of Auckland
Assay Description
IC50 is the inhibitor concentration which inhibits 50% of kinase activity that catalyzes the transfer of the terminal phosphate from [gamma-32P] labe...
J Med Chem 43: 3134-47 (2000)
Article DOI: 10.1021/jm000148t
BindingDB Entry DOI: 10.7270/Q2028PQ1
Tyrosine-protein kinase Lck
(Homo sapiens (Human))
BDBM4213
(6-(2,6-dichlorophenyl)-8-methyl-2-{[4-(morpholin-4...)
Show SMILES Cn1c2nc(Nc3ccc(cc3)N3CCOCC3)ncc2cc(-c2c(Cl)cccc2Cl)c1=O |(-.52,-2.15,;-.52,-.61,;-1.86,.16,;-3.19,-.61,;-4.53,.16,;-5.86,-.61,;-7.19,.16,;-8.55,-.56,;-9.86,.26,;-9.8,1.8,;-8.44,2.52,;-7.14,1.7,;-11.11,2.62,;-11.11,4.16,;-12.44,4.93,;-13.78,4.16,;-13.78,2.62,;-12.44,1.85,;-4.53,1.7,;-3.19,2.47,;-1.86,1.7,;-.52,2.47,;.81,1.7,;2.14,2.47,;2.14,4.01,;.81,4.78,;3.48,4.78,;4.81,4.01,;4.81,2.47,;3.48,1.7,;3.48,.16,;.81,.16,;2.14,-.61,)|
Show InChI InChI=1S/C24H21Cl2N5O2/c1-30-22-15(13-18(23(30)32)21-19(25)3-2-4-20(21)26)14-27-24(29-22)28-16-5-7-17(8-6-16)31-9-11-33-12-10-31/h2-8,13-14H,9-12H2,1H3,(H,27,28,29)
n/an/a<5n/an/an/an/an/an/a
Parke-Davis Pharmaceutical Research
Assay Description
The kinase activity was measured by DELFIA/time-resolved fluorometry. The reaction was carried out in 96-well polypropylene plates and was terminated...
Biochem Pharmacol 60: 885-98 (2000)
Article DOI: 10.1016/s0006-2952(00)00405-6
BindingDB Entry DOI: 10.7270/Q2MC8X7B
Platelet-derived growth factor receptor beta
(Homo sapiens (Human))
BDBM4213
(6-(2,6-dichlorophenyl)-8-methyl-2-{[4-(morpholin-4...)
Show SMILES Cn1c2nc(Nc3ccc(cc3)N3CCOCC3)ncc2cc(-c2c(Cl)cccc2Cl)c1=O |(-.52,-2.15,;-.52,-.61,;-1.86,.16,;-3.19,-.61,;-4.53,.16,;-5.86,-.61,;-7.19,.16,;-8.55,-.56,;-9.86,.26,;-9.8,1.8,;-8.44,2.52,;-7.14,1.7,;-11.11,2.62,;-11.11,4.16,;-12.44,4.93,;-13.78,4.16,;-13.78,2.62,;-12.44,1.85,;-4.53,1.7,;-3.19,2.47,;-1.86,1.7,;-.52,2.47,;.81,1.7,;2.14,2.47,;2.14,4.01,;.81,4.78,;3.48,4.78,;4.81,4.01,;4.81,2.47,;3.48,1.7,;3.48,.16,;.81,.16,;2.14,-.61,)|
Show InChI InChI=1S/C24H21Cl2N5O2/c1-30-22-15(13-18(23(30)32)21-19(25)3-2-4-20(21)26)14-27-24(29-22)28-16-5-7-17(8-6-16)31-9-11-33-12-10-31/h2-8,13-14H,9-12H2,1H3,(H,27,28,29)
NCI pathway
Reactome pathway
n/an/a 636n/an/an/an/a7.425
Parke-Davis Pharmaceutical Research
Assay Description
IC50 is the inhibitor concentration which inhibits 50% of kinase activity that catalyzes the transfer of the terminal phosphate from [gamma-32P] labe...
Biochem Pharmacol 60: 885-98 (2000)
Article DOI: 10.1016/s0006-2952(00)00405-6
BindingDB Entry DOI: 10.7270/Q2MC8X7B
Proto-oncogene tyrosine-protein kinase Src
(Homo sapiens (Human))
BDBM4213
(6-(2,6-dichlorophenyl)-8-methyl-2-{[4-(morpholin-4...)
Show SMILES Cn1c2nc(Nc3ccc(cc3)N3CCOCC3)ncc2cc(-c2c(Cl)cccc2Cl)c1=O |(-.52,-2.15,;-.52,-.61,;-1.86,.16,;-3.19,-.61,;-4.53,.16,;-5.86,-.61,;-7.19,.16,;-8.55,-.56,;-9.86,.26,;-9.8,1.8,;-8.44,2.52,;-7.14,1.7,;-11.11,2.62,;-11.11,4.16,;-12.44,4.93,;-13.78,4.16,;-13.78,2.62,;-12.44,1.85,;-4.53,1.7,;-3.19,2.47,;-1.86,1.7,;-.52,2.47,;.81,1.7,;2.14,2.47,;2.14,4.01,;.81,4.78,;3.48,4.78,;4.81,4.01,;4.81,2.47,;3.48,1.7,;3.48,.16,;.81,.16,;2.14,-.61,)|
Show InChI InChI=1S/C24H21Cl2N5O2/c1-30-22-15(13-18(23(30)32)21-19(25)3-2-4-20(21)26)14-27-24(29-22)28-16-5-7-17(8-6-16)31-9-11-33-12-10-31/h2-8,13-14H,9-12H2,1H3,(H,27,28,29)
n/an/a 8.35n/an/an/an/a7.525
Parke-Davis Pharmaceutical Research
Assay Description
IC50 is the inhibitor concentration which inhibits 50% of kinase activity that catalyzes the transfer of the terminal phosphate from [gamma-32P] labe...
Biochem Pharmacol 60: 885-98 (2000)
Article DOI: 10.1016/s0006-2952(00)00405-6
BindingDB Entry DOI: 10.7270/Q2MC8X7B
Fibroblast growth factor receptor 1
(Homo sapiens (Human))
BDBM4213
(6-(2,6-dichlorophenyl)-8-methyl-2-{[4-(morpholin-4...)
Show SMILES Cn1c2nc(Nc3ccc(cc3)N3CCOCC3)ncc2cc(-c2c(Cl)cccc2Cl)c1=O |(-.52,-2.15,;-.52,-.61,;-1.86,.16,;-3.19,-.61,;-4.53,.16,;-5.86,-.61,;-7.19,.16,;-8.55,-.56,;-9.86,.26,;-9.8,1.8,;-8.44,2.52,;-7.14,1.7,;-11.11,2.62,;-11.11,4.16,;-12.44,4.93,;-13.78,4.16,;-13.78,2.62,;-12.44,1.85,;-4.53,1.7,;-3.19,2.47,;-1.86,1.7,;-.52,2.47,;.81,1.7,;2.14,2.47,;2.14,4.01,;.81,4.78,;3.48,4.78,;4.81,4.01,;4.81,2.47,;3.48,1.7,;3.48,.16,;.81,.16,;2.14,-.61,)|
Show InChI InChI=1S/C24H21Cl2N5O2/c1-30-22-15(13-18(23(30)32)21-19(25)3-2-4-20(21)26)14-27-24(29-22)28-16-5-7-17(8-6-16)31-9-11-33-12-10-31/h2-8,13-14H,9-12H2,1H3,(H,27,28,29)
NCI pathway
Reactome pathway
n/an/a 98.8n/an/an/an/a7.425
Parke-Davis Pharmaceutical Research
Assay Description
IC50 is the inhibitor concentration which inhibits 50% of kinase activity that catalyzes the transfer of the terminal phosphate from [gamma-32P] labe...
Biochem Pharmacol 60: 885-98 (2000)
Article DOI: 10.1016/s0006-2952(00)00405-6
BindingDB Entry DOI: 10.7270/Q2MC8X7B