BDBM4215 AHPBA 1a::benzyl N-[(1S)-1-{[(2S,3S)-4-[(2S)-2-(tert-butylcarbamoyl)pyrrolidin-1-yl]-3-hydroxy-4-oxo-1-phenylbutan-2-yl]carbamoyl}-2-carbamoylethyl]carbamate
SMILES: CC(C)(C)NC(=O)[C@@H]1CCCN1C(=O)[C@@H](O)[C@H](Cc1ccccc1)NC(=O)[C@H](CC(N)=O)NC(=O)OCc1ccccc1
InChI Key: InChIKey=XCVUOCMQYKSJJR-IGRGDXOOSA-N
Data: 2 KI  2 IC50
PDB links: 1 PDB ID contains inhibitors having a similarity of 90% to this monomer.
Activity Spreadsheet -- Enzyme Inhibition Constant Data from BindingDB
Found 4 hits for monomerid = 4215
Trg + Lig
Ki
nM
ΔG°
kcal/mole
IC50
nM
Kd
nM
EC50/IC50
nM
koff
s-1
kon
M-1s-1
pHTemp
°C
Human immunodeficiency virus type 1 protease
(Human immunodeficiency virus type 1)
BDBM4215
(AHPBA 1a | benzyl N-[(1S)-1-{[(2S,3S)-4-[(2S)-2-(t...)
Show SMILES CC(C)(C)NC(=O)[C@@H]1CCCN1C(=O)[C@@H](O)[C@H](Cc1ccccc1)NC(=O)[C@H](CC(N)=O)NC(=O)OCc1ccccc1 |r|
Show InChI InChI=1S/C31H41N5O7/c1-31(2,3)35-28(40)24-15-10-16-36(24)29(41)26(38)22(17-20-11-6-4-7-12-20)33-27(39)23(18-25(32)37)34-30(42)43-19-21-13-8-5-9-14-21/h4-9,11-14,22-24,26,38H,10,15-19H2,1-3H3,(H2,32,37)(H,33,39)(H,34,42)(H,35,40)/t22-,23-,24-,26-/m0/s1
4n/an/an/an/an/an/an/an/a
Syntex Research Canada
Curated by ChEMBL
Assay Description
Binding affinity against HIV Protease enzyme.(by Dixon analysis)
J Med Chem 35: 1318-20 (1992)
BindingDB Entry DOI: 10.7270/Q2W959T5
HIV-1 Protease
(Human immunodeficiency virus type 1)
BDBM4215
(AHPBA 1a | benzyl N-[(1S)-1-{[(2S,3S)-4-[(2S)-2-(t...)
Show SMILES CC(C)(C)NC(=O)[C@@H]1CCCN1C(=O)[C@@H](O)[C@H](Cc1ccccc1)NC(=O)[C@H](CC(N)=O)NC(=O)OCc1ccccc1 |r|
Show InChI InChI=1S/C31H41N5O7/c1-31(2,3)35-28(40)24-15-10-16-36(24)29(41)26(38)22(17-20-11-6-4-7-12-20)33-27(39)23(18-25(32)37)34-30(42)43-19-21-13-8-5-9-14-21/h4-9,11-14,22-24,26,38H,10,15-19H2,1-3H3,(H2,32,37)(H,33,39)(H,34,42)(H,35,40)/t22-,23-,24-,26-/m0/s1
57.5 -10.3n/an/an/an/an/a4.737
Sankyo Co. Ltd.
Assay Description
The inhibitory activities of the compounds toward HIV-1 PR were determined by sodium dodecyl sulfate-polyacrylamide gel electrophoresis (SDS-PAGE) as...
Bioorg Med Chem 4: 1365-77 (1996)
Article DOI: 10.1016/0968-0896(96)00130-7
BindingDB Entry DOI: 10.7270/Q2V9868K
Human immunodeficiency virus type 1 protease
(Human immunodeficiency virus type 1)
BDBM4215
(AHPBA 1a | benzyl N-[(1S)-1-{[(2S,3S)-4-[(2S)-2-(t...)
Show SMILES CC(C)(C)NC(=O)[C@@H]1CCCN1C(=O)[C@@H](O)[C@H](Cc1ccccc1)NC(=O)[C@H](CC(N)=O)NC(=O)OCc1ccccc1 |r|
Show InChI InChI=1S/C31H41N5O7/c1-31(2,3)35-28(40)24-15-10-16-36(24)29(41)26(38)22(17-20-11-6-4-7-12-20)33-27(39)23(18-25(32)37)34-30(42)43-19-21-13-8-5-9-14-21/h4-9,11-14,22-24,26,38H,10,15-19H2,1-3H3,(H2,32,37)(H,33,39)(H,34,42)(H,35,40)/t22-,23-,24-,26-/m0/s1
n/an/a 7.40n/an/an/an/an/an/a
Syntex Research Canada
Curated by ChEMBL
Assay Description
Inhibitory activity of the Compound was tested against HIV protease enzyme.
J Med Chem 35: 1318-20 (1992)
BindingDB Entry DOI: 10.7270/Q2W959T5
Human immunodeficiency virus type 1 protease
(Human immunodeficiency virus type 1)
BDBM4215
(AHPBA 1a | benzyl N-[(1S)-1-{[(2S,3S)-4-[(2S)-2-(t...)
Show SMILES CC(C)(C)NC(=O)[C@@H]1CCCN1C(=O)[C@@H](O)[C@H](Cc1ccccc1)NC(=O)[C@H](CC(N)=O)NC(=O)OCc1ccccc1 |r|
Show InChI InChI=1S/C31H41N5O7/c1-31(2,3)35-28(40)24-15-10-16-36(24)29(41)26(38)22(17-20-11-6-4-7-12-20)33-27(39)23(18-25(32)37)34-30(42)43-19-21-13-8-5-9-14-21/h4-9,11-14,22-24,26,38H,10,15-19H2,1-3H3,(H2,32,37)(H,33,39)(H,34,42)(H,35,40)/t22-,23-,24-,26-/m0/s1
n/an/a 7.40n/an/an/an/an/an/a
Washington University
Curated by ChEMBL
Assay Description
Inhibitory potency against HIV-1 protease
J Med Chem 36: 4152-60 (1994)
BindingDB Entry DOI: 10.7270/Q2PK0HCT