BDBM4221 AHPBA 29a::Z-Asn-(2S,3S)-AHPBA- [4(S)-fluoro] Pro tert-butylamide::benzyl N-[(1S)-1-{[(2S,3S)-4-[(2S)-2-(tert-butylcarbamoyl)-4-fluoropyrrolidin-1-yl]-3-hydroxy-4-oxo-1-phenylbutan-2-yl]carbamoyl}-2-carbamoylethyl]carbamate
SMILES: CC(C)(C)NC(=O)[C@@H]1CC(F)CN1C(=O)[C@@H](O)[C@H](Cc1ccccc1)NC(=O)[C@H](CC(N)=O)NC(=O)OCc1ccccc1
InChI Key: InChIKey=VRYMULDNXLDXSM-RDZHBEFDSA-N
Data: 1 KI
Activity Spreadsheet -- Enzyme Inhibition Constant Data from BindingDB
Found 1 hit for monomerid = 4221
Trg + Lig
Ki
nM
ΔG°
kcal/mole
IC50
nM
Kd
nM
EC50/IC50
nM
koff
s-1
kon
M-1s-1
pHTemp
°C
HIV-1 Protease
(Human immunodeficiency virus type 1)
BDBM4221
(AHPBA 29a | Z-Asn-(2S,3S)-AHPBA- [4(S)-fluoro] Pro...)
Show SMILES CC(C)(C)NC(=O)[C@@H]1CC(F)CN1C(=O)[C@@H](O)[C@H](Cc1ccccc1)NC(=O)[C@H](CC(N)=O)NC(=O)OCc1ccccc1 |r|
Show InChI InChI=1S/C31H40FN5O7/c1-31(2,3)36-28(41)24-15-21(32)17-37(24)29(42)26(39)22(14-19-10-6-4-7-11-19)34-27(40)23(16-25(33)38)35-30(43)44-18-20-12-8-5-9-13-20/h4-13,21-24,26,39H,14-18H2,1-3H3,(H2,33,38)(H,34,40)(H,35,43)(H,36,41)/t21?,22-,23-,24-,26-/m0/s1
18 -11.0n/an/an/an/an/a4.737
Sankyo Co. Ltd.
Assay Description
The inhibitory activities of the compounds toward HIV-1 PR were determined by sodium dodecyl sulfate-polyacrylamide gel electrophoresis (SDS-PAGE) as...
Bioorg Med Chem 4: 1365-77 (1996)
Article DOI: 10.1016/0968-0896(96)00130-7
BindingDB Entry DOI: 10.7270/Q2V9868K