BDBM4227 AHPBA 35a::Z-Asn.(2S,3S)-AHPBA-[3(R)-hydroxy]Pro tert-butyiamide::benzyl N-[(1S)-1-{[(2S,3S)-4-[(2S)-2-(tert-butylcarbamoyl)-3-hydroxypyrrolidin-1-yl]-3-hydroxy-4-oxo-1-phenylbutan-2-yl]carbamoyl}-2-carbamoylethyl]carbamate
SMILES: CC(C)(C)NC(=O)[C@@H]1C(O)CCN1C(=O)[C@@H](O)[C@H](Cc1ccccc1)NC(=O)[C@H](CC(N)=O)NC(=O)OCc1ccccc1
InChI Key: InChIKey=ILBLUQCBVBLLRO-KESOBZGQSA-N
Data: 1 KI
Activity Spreadsheet -- Enzyme Inhibition Constant Data from BindingDB
Found 1 hit for monomerid = 4227
Trg + Lig
Ki
nM
ΔG°
kcal/mole
IC50
nM
Kd
nM
EC50/IC50
nM
koff
s-1
kon
M-1s-1
pHTemp
°C
HIV-1 Protease
(Human immunodeficiency virus type 1)
BDBM4227
(AHPBA 35a | Z-Asn.(2S,3S)-AHPBA-[3(R)-hydroxy]Pro ...)
Show SMILES CC(C)(C)NC(=O)[C@@H]1C(O)CCN1C(=O)[C@@H](O)[C@H](Cc1ccccc1)NC(=O)[C@H](CC(N)=O)NC(=O)OCc1ccccc1 |r|
Show InChI InChI=1S/C31H41N5O8/c1-31(2,3)35-28(41)25-23(37)14-15-36(25)29(42)26(39)21(16-19-10-6-4-7-11-19)33-27(40)22(17-24(32)38)34-30(43)44-18-20-12-8-5-9-13-20/h4-13,21-23,25-26,37,39H,14-18H2,1-3H3,(H2,32,38)(H,33,40)(H,34,43)(H,35,41)/t21-,22-,23?,25-,26-/m0/s1
0.100 -14.2n/an/an/an/an/a4.737
Sankyo Co. Ltd.
Assay Description
The inhibitory activities of the compounds toward HIV-1 PR were determined by sodium dodecyl sulfate-polyacrylamide gel electrophoresis (SDS-PAGE) as...
Bioorg Med Chem 4: 1365-77 (1996)
Article DOI: 10.1016/0968-0896(96)00130-7
BindingDB Entry DOI: 10.7270/Q2V9868K