null
SMILES: CC(C)OC(=O)CSc1nnc(-c2cccnc2)n1N
InChI Key: InChIKey=WHSZCOMPIJHMGX-UHFFFAOYSA-N
Activity Spreadsheet -- Enzyme Inhibition Constant Data from BindingDB
Found 1 hit for monomerid = 42301
Trg + Lig
Ki
nM
ΔG°
kcal/mole
IC50
nM
Kd
nM
EC50/IC50
nM
koff
s-1
kon
M-1s-1
pHTemp
°C
Lysosomal acid glucosylceramidase
(Homo sapiens (Human))
BDBM42301
(2-[[4-amino-5-(3-pyridinyl)-1,2,4-triazol-3-yl]thi...)
Show SMILES CC(C)OC(=O)CSc1nnc(-c2cccnc2)n1N
Show InChI InChI=1S/C12H15N5O2S/c1-8(2)19-10(18)7-20-12-16-15-11(17(12)13)9-4-3-5-14-6-9/h3-6,8H,7,13H2,1-2H3
Reactome pathway
PCBioAssay
n/an/an/an/a>1.00E+4n/an/an/an/a
The Scripps Research Institute Molecular Screening Center
Curated by PubChem BioAssay
Assay Description
Source (MLSCN Center Name): The Scripps Research Institute Molecular Screening Center Center Affiliation: The Scripps Research Institute, TSRI Assay ...
PubChem Bioassay (2008)
BindingDB Entry DOI: 10.7270/Q23J3BC8