BDBM42303 2-(4-benzofuro[3,2-d]pyrimidinylthio)-N-(3-fluorophenyl)acetamide::2-([1]benzofuro[3,2-d]pyrimidin-4-ylsulfanyl)-N-(3-fluorophenyl)acetamide::2-([1]benzofuro[3,2-d]pyrimidin-4-ylsulfanyl)-N-(3-fluorophenyl)ethanamide::2-(benzofuro[3,2-d]pyrimidin-4-ylthio)-N-(3-fluorophenyl)acetamide::MLS000039473::SMR000035236::cid_663542
SMILES: Fc1cccc(NC(=O)CSc2ncnc3c4ccccc4oc23)c1
InChI Key: InChIKey=RJJVVEZXWHAYPD-UHFFFAOYSA-N
Data: 2 IC50  1 EC50
Activity Spreadsheet -- Enzyme Inhibition Constant Data from BindingDB
Found 3 hits for monomerid = 42303
Trg + Lig
Ki
nM
ΔG°
kcal/mole
IC50
nM
Kd
nM
EC50/IC50
nM
koff
s-1
kon
M-1s-1
pHTemp
°C
Lysosomal acid glucosylceramidase
(Homo sapiens (Human))
BDBM42303
(2-(4-benzofuro[3,2-d]pyrimidinylthio)-N-(3-fluorop...)
Show SMILES Fc1cccc(NC(=O)CSc2ncnc3c4ccccc4oc23)c1
Show InChI InChI=1S/C18H12FN3O2S/c19-11-4-3-5-12(8-11)22-15(23)9-25-18-17-16(20-10-21-18)13-6-1-2-7-14(13)24-17/h1-8,10H,9H2,(H,22,23)
Reactome pathway
PCBioAssay
n/an/an/an/a>1.00E+4n/an/an/an/a
The Scripps Research Institute Molecular Screening Center
Curated by PubChem BioAssay
Assay Description
Source (MLSCN Center Name): The Scripps Research Institute Molecular Screening Center Center Affiliation: The Scripps Research Institute, TSRI Assay ...
PubChem Bioassay (2008)
BindingDB Entry DOI: 10.7270/Q23J3BC8
EBNA-1 protein
(Human herpesvirus 4)
BDBM42303
(2-(4-benzofuro[3,2-d]pyrimidinylthio)-N-(3-fluorop...)
Show SMILES Fc1cccc(NC(=O)CSc2ncnc3c4ccccc4oc23)c1
Show InChI InChI=1S/C18H12FN3O2S/c19-11-4-3-5-12(8-11)22-15(23)9-25-18-17-16(20-10-21-18)13-6-1-2-7-14(13)24-17/h1-8,10H,9H2,(H,22,23)
PCBioAssay
n/an/a 1.48E+5n/an/an/an/an/an/a
The Scripps Research Institute Molecular Screening Center
Curated by PubChem BioAssay
Assay Description
Source (MLPCN Center Name): The Scripps Research Institute Molecular Screening Center (SRIMSC) Center Affiliation: The Scripps Research Institute (TS...
PubChem Bioassay (2010)
BindingDB Entry DOI: 10.7270/Q2RJ4GXC
BZLF1
(Human herpesvirus 4)
BDBM42303
(2-(4-benzofuro[3,2-d]pyrimidinylthio)-N-(3-fluorop...)
Show SMILES Fc1cccc(NC(=O)CSc2ncnc3c4ccccc4oc23)c1
Show InChI InChI=1S/C18H12FN3O2S/c19-11-4-3-5-12(8-11)22-15(23)9-25-18-17-16(20-10-21-18)13-6-1-2-7-14(13)24-17/h1-8,10H,9H2,(H,22,23)
PCBioAssay
n/an/a 1.11E+5n/an/an/an/an/an/a
The Scripps Research Institute Molecular Screening Center
Curated by PubChem BioAssay
Assay Description
Source (MLPCN Center Name): The Scripps Research Institute Molecular Screening Center (SRIMSC) Center Affiliation: The Scripps Research Institute (TS...
PubChem Bioassay (2010)
BindingDB Entry DOI: 10.7270/Q2W957MN