BDBM4234 (1-Methylindazole-3-carbonyl)-Asn-(2S,3S)-AHPBA-[4(S)-chloro]Pro tert-butylamide::(2S)-N-[(2S,3S)-4-[(2S,4S)-2-(tert-butylcarbamoyl)-4-chloropyrrolidin-1-yl]-3-hydroxy-4-oxo-1-phenylbutan-2-yl]-2-[(1-methyl-1H-indazol-3-yl)formamido]butanediamide::AHPBA 42a
SMILES: Cn1nc(C(=O)N[C@@H](CC(N)=O)C(=O)N[C@@H](Cc2ccccc2)[C@H](O)C(=O)N2C[C@@H](Cl)C[C@H]2C(=O)NC(C)(C)C)c2ccccc12
InChI Key: InChIKey=IXYGCKAGSTXCJO-FYJOQDGYSA-N
Data: 1 KI
Activity Spreadsheet -- Enzyme Inhibition Constant Data from BindingDB
Found 1 hit for monomerid = 4234
Trg + Lig
Ki
nM
ΔG°
kcal/mole
IC50
nM
Kd
nM
EC50/IC50
nM
koff
s-1
kon
M-1s-1
pHTemp
°C
HIV-1 Protease
(Human immunodeficiency virus type 1)
BDBM4234
((1-Methylindazole-3-carbonyl)-Asn-(2S,3S)-AHPBA-[4...)
Show SMILES Cn1nc(C(=O)N[C@@H](CC(N)=O)C(=O)N[C@@H](Cc2ccccc2)[C@H](O)C(=O)N2C[C@@H](Cl)C[C@H]2C(=O)NC(C)(C)C)c2ccccc12 |r|
Show InChI InChI=1S/C32H40ClN7O6/c1-32(2,3)37-29(44)24-15-19(33)17-40(24)31(46)27(42)21(14-18-10-6-5-7-11-18)35-28(43)22(16-25(34)41)36-30(45)26-20-12-8-9-13-23(20)39(4)38-26/h5-13,19,21-22,24,27,42H,14-17H2,1-4H3,(H2,34,41)(H,35,43)(H,36,45)(H,37,44)/t19-,21-,22-,24-,27-/m0/s1
16 -11.1n/an/an/an/an/a4.737
Sankyo Co. Ltd.
Assay Description
The inhibitory activities of the compounds toward HIV-1 PR were determined by sodium dodecyl sulfate-polyacrylamide gel electrophoresis (SDS-PAGE) as...
Bioorg Med Chem 4: 1365-77 (1996)
Article DOI: 10.1016/0968-0896(96)00130-7
BindingDB Entry DOI: 10.7270/Q2V9868K