BDBM4256 (2S,4S)-N-tert-butyl-4-chloro-1-[(2S,3S)-3-[(2,6-dimethylphenyl)formamido]-2-hydroxy-4-phenylbutanoyl]pyrrolidine-2-carboxamide::2,6-Dimethylbenzoyl-(2S,3S)-AHPBA-4(S)-Cl-Pro-NH-t-Bu::AHPBA 25::CHEMBL324388
SMILES: Cc1cccc(C)c1C(=O)N[C@@H](Cc1ccccc1)[C@H](O)C(=O)N1C[C@@H](Cl)C[C@H]1C(=O)NC(C)(C)C
InChI Key: InChIKey=MKLAZCHGZXXXDU-CDNNERCOSA-N
Data: 2 IC50
Activity Spreadsheet -- Enzyme Inhibition Constant Data from BindingDB
Found 2 hits for monomerid = 4256
Trg + Lig
Ki
nM
ΔG°
kcal/mole
IC50
nM
Kd
nM
EC50/IC50
nM
koff
s-1
kon
M-1s-1
pHTemp
°C
Human immunodeficiency virus type 1 protease
(Human immunodeficiency virus type 1)
BDBM4256
((2S,4S)-N-tert-butyl-4-chloro-1-[(2S,3S)-3-[(2,6-d...)
Show SMILES Cc1cccc(C)c1C(=O)N[C@@H](Cc1ccccc1)[C@H](O)C(=O)N1C[C@@H](Cl)C[C@H]1C(=O)NC(C)(C)C |r|
Show InChI InChI=1S/C28H36ClN3O4/c1-17-10-9-11-18(2)23(17)26(35)30-21(14-19-12-7-6-8-13-19)24(33)27(36)32-16-20(29)15-22(32)25(34)31-28(3,4)5/h6-13,20-22,24,33H,14-16H2,1-5H3,(H,30,35)(H,31,34)/t20-,21-,22-,24-/m0/s1
n/an/a 3.60n/an/an/an/an/an/a
Chinese Academy of Sciences
Curated by ChEMBL
Assay Description
Inhibitory activity against HIV-1 protease
J Med Chem 45: 333-43 (2002)
BindingDB Entry DOI: 10.7270/Q20K27VB
HIV-1 Protease
(Human immunodeficiency virus type 1)
BDBM4256
((2S,4S)-N-tert-butyl-4-chloro-1-[(2S,3S)-3-[(2,6-d...)
Show SMILES Cc1cccc(C)c1C(=O)N[C@@H](Cc1ccccc1)[C@H](O)C(=O)N1C[C@@H](Cl)C[C@H]1C(=O)NC(C)(C)C |r|
Show InChI InChI=1S/C28H36ClN3O4/c1-17-10-9-11-18(2)23(17)26(35)30-21(14-19-12-7-6-8-13-19)24(33)27(36)32-16-20(29)15-22(32)25(34)31-28(3,4)5/h6-13,20-22,24,33H,14-16H2,1-5H3,(H,30,35)(H,31,34)/t20-,21-,22-,24-/m0/s1
n/an/a 3.60n/an/an/an/an/an/a
Sankyo Co. Ltd.
Assay Description
The inhibitory activities of the compounds toward HIV-1 PR were determined by sodium dodecyl sulfate-polyacrylamide gel electrophoresis (SDS-PAGE) as...
Bioorg Med Chem 6: 595-604 (1998)
Article DOI: 10.1016/s0968-0896(98)00004-2
BindingDB Entry DOI: 10.7270/Q2QN64XQ