BDBM4295 (2E)-3-(3,4-dihydroxyphenyl)-2-[(4-methylphenyl)carbonyl]prop-2-enenitrile::Tyrphostin deriv. 28
SMILES: Cc1ccc(cc1)C(=O)C(=C\c1ccc(O)c(O)c1)\C#N
InChI Key: InChIKey=ZALNJTCOAIAQFA-RIYZIHGNSA-N
Data: 4 IC50
Activity Spreadsheet -- Enzyme Inhibition Constant Data from BindingDB
Found 4 hits for monomerid = 4295
Trg + Lig
Ki
nM
ΔG°
kcal/mole
IC50
nM
Kd
nM
EC50/IC50
nM
koff
s-1
kon
M-1s-1
pHTemp
°C
Epidermal growth factor receptor
(Homo sapiens (Human))
BDBM4295
((2E)-3-(3,4-dihydroxyphenyl)-2-[(4-methylphenyl)ca...)
Show SMILES Cc1ccc(cc1)C(=O)C(=C\c1ccc(O)c(O)c1)\C#N
Show InChI InChI=1S/C17H13NO3/c1-11-2-5-13(6-3-11)17(21)14(10-18)8-12-4-7-15(19)16(20)9-12/h2-9,19-20H,1H3/b14-8+
n/an/a 880n/an/an/an/an/an/a
Hebrew University of Jerusalem
Assay Description
The activity of EGFR, preactivated with EGF, is measured by its ability to transfer terminal phosphate from [gamma-32P]ATP to poly(GAT) substrate.
J Med Chem 34: 1896-907 (1991)
Article DOI: 10.1021/jm00110a022
BindingDB Entry DOI: 10.7270/Q2KW5D7V
Receptor tyrosine-protein kinase erbB-2
(Homo sapiens (Human))
BDBM4295
((2E)-3-(3,4-dihydroxyphenyl)-2-[(4-methylphenyl)ca...)
Show SMILES Cc1ccc(cc1)C(=O)C(=C\c1ccc(O)c(O)c1)\C#N
Show InChI InChI=1S/C17H13NO3/c1-11-2-5-13(6-3-11)17(21)14(10-18)8-12-4-7-15(19)16(20)9-12/h2-9,19-20H,1H3/b14-8+
n/an/a 1.00E+4n/an/an/an/an/an/a
University of Tennessee Health Sciences Center
Curated by ChEMBL
Assay Description
Inhibitory activity tested against protein kinase HER-2
J Med Chem 46: 4657-68 (2003)
Article DOI: 10.1021/jm030065n
BindingDB Entry DOI: 10.7270/Q2N58NKR
Epidermal growth factor receptor
(Homo sapiens (Human))
BDBM4295
((2E)-3-(3,4-dihydroxyphenyl)-2-[(4-methylphenyl)ca...)
Show SMILES Cc1ccc(cc1)C(=O)C(=C\c1ccc(O)c(O)c1)\C#N
Show InChI InChI=1S/C17H13NO3/c1-11-2-5-13(6-3-11)17(21)14(10-18)8-12-4-7-15(19)16(20)9-12/h2-9,19-20H,1H3/b14-8+
n/an/a 1.51E+4n/an/an/an/an/an/a
University of Tennessee Health Sciences Center
Curated by ChEMBL
Assay Description
Inhibitory activity against epidermal growth factor receptor (EGFR)
J Med Chem 46: 4657-68 (2003)
Article DOI: 10.1021/jm030065n
BindingDB Entry DOI: 10.7270/Q2N58NKR
Epidermal growth factor receptor
(Homo sapiens (Human))
BDBM4295
((2E)-3-(3,4-dihydroxyphenyl)-2-[(4-methylphenyl)ca...)
Show SMILES Cc1ccc(cc1)C(=O)C(=C\c1ccc(O)c(O)c1)\C#N
Show InChI InChI=1S/C17H13NO3/c1-11-2-5-13(6-3-11)17(21)14(10-18)8-12-4-7-15(19)16(20)9-12/h2-9,19-20H,1H3/b14-8+
n/an/a 9n/an/an/an/an/an/a
TBA
Curated by ChEMBL
Assay Description
Inhibition of EGFR in human A431 cells
J Nat Prod 55: 1529-1560 (1992)
Article DOI: 10.1021/np50089a001
BindingDB Entry DOI: 10.7270/Q2J966CC