BDBM43294 2,5-dimethoxy-N-(2-oxidanylnaphthalen-1-yl)benzenesulfonamide::N-(2-hydroxy-1-naphthalenyl)-2,5-dimethoxybenzenesulfonamide::N-(2-hydroxy-1-naphthyl)-2,5-dimethoxy-benzenesulfonamide::N-(2-hydroxynaphthalen-1-yl)-2,5-dimethoxybenzenesulfonamide::PC-0596522::PCMD-CC-PAB-250::cid_16738582
SMILES: COc1ccc(OC)c(c1)S(=O)(=O)Nc1c(O)ccc2ccccc12
InChI Key: InChIKey=OBTDLEZTLKOMEI-UHFFFAOYSA-N
Data: 1 IC50
Activity Spreadsheet -- Enzyme Inhibition Constant Data from BindingDB
Found 1 hit for monomerid = 43294
Trg + Lig
Ki
nM
ΔG°
kcal/mole
IC50
nM
Kd
nM
EC50/IC50
nM
koff
s-1
kon
M-1s-1
pHTemp
°C
RNA polymerase beta subunit (EC 2.7.7.6)
(Escherichia coli)
BDBM43294
(2,5-dimethoxy-N-(2-oxidanylnaphthalen-1-yl)benzene...)
Show SMILES COc1ccc(OC)c(c1)S(=O)(=O)Nc1c(O)ccc2ccccc12
Show InChI InChI=1S/C18H17NO5S/c1-23-13-8-10-16(24-2)17(11-13)25(21,22)19-18-14-6-4-3-5-12(14)7-9-15(18)20/h3-11,19-20H,1-2H3
PCBioAssay
n/an/a 1.94E+4n/an/an/an/an/an/a
PCMD
Curated by PubChem BioAssay
Assay Description
Screening Center: Penn Center for Molecular Discovery Center Affiliation: University of Pennsylvania Network: Molecular Library Screening Center Netw...
PubChem Bioassay (2008)
BindingDB Entry DOI: 10.7270/Q25B00VT