BDBM43336 4-methyl-N-(2-oxidanylnaphthalen-1-yl)benzenesulfonamide::N-(2-hydroxy-1-naphthalenyl)-4-methylbenzenesulfonamide::N-(2-hydroxy-1-naphthyl)-4-methyl-benzenesulfonamide::N-(2-hydroxynaphthalen-1-yl)-4-methylbenzenesulfonamide::PC-0626782::PCMD-CC-PAB-248::cid_12936671
SMILES: Cc1ccc(cc1)S(=O)(=O)Nc1c(O)ccc2ccccc12
InChI Key: InChIKey=KRRRBZQMKSJUPG-UHFFFAOYSA-N
Data: 3 IC50
Activity Spreadsheet -- Enzyme Inhibition Constant Data from BindingDB
Found 3 hits for monomerid = 43336
Trg + Lig
Ki
nM
ΔG°
kcal/mole
IC50
nM
Kd
nM
EC50/IC50
nM
koff
s-1
kon
M-1s-1
pHTemp
°C
RNA polymerase beta subunit (EC 2.7.7.6)
(Escherichia coli)
BDBM43336
(4-methyl-N-(2-oxidanylnaphthalen-1-yl)benzenesulfo...)
Show SMILES Cc1ccc(cc1)S(=O)(=O)Nc1c(O)ccc2ccccc12
Show InChI InChI=1S/C17H15NO3S/c1-12-6-9-14(10-7-12)22(20,21)18-17-15-5-3-2-4-13(15)8-11-16(17)19/h2-11,18-19H,1H3
PCBioAssay
n/an/a 2.29E+4n/an/an/an/an/an/a
PCMD
Curated by PubChem BioAssay
Assay Description
Screening Center: Penn Center for Molecular Discovery Center Affiliation: University of Pennsylvania Network: Molecular Library Screening Center Netw...
PubChem Bioassay (2008)
BindingDB Entry DOI: 10.7270/Q25B00VT
putative hexokinase HKDC1
(Homo sapiens (Human))
BDBM43336
(4-methyl-N-(2-oxidanylnaphthalen-1-yl)benzenesulfo...)
Show SMILES Cc1ccc(cc1)S(=O)(=O)Nc1c(O)ccc2ccccc12
Show InChI InChI=1S/C17H15NO3S/c1-12-6-9-14(10-7-12)22(20,21)18-17-15-5-3-2-4-13(15)8-11-16(17)19/h2-11,18-19H,1H3
PCBioAssay
n/an/a 2.74E+4n/an/an/an/an/an/a
Burnham Center for Chemical Genomics
Curated by PubChem BioAssay
Assay Description
Data Source: Sanford-Burnham Center for Chemical Genomics (SBCCG) Source Affiliation: Sanford-Burnham Medical Research Institute (SBMRI, San Diego, C...
PubChem Bioassay (2011)
BindingDB Entry DOI: 10.7270/Q23F4N3R
putative hexokinase HKDC1
(Homo sapiens (Human))
BDBM43336
(4-methyl-N-(2-oxidanylnaphthalen-1-yl)benzenesulfo...)
Show SMILES Cc1ccc(cc1)S(=O)(=O)Nc1c(O)ccc2ccccc12
Show InChI InChI=1S/C17H15NO3S/c1-12-6-9-14(10-7-12)22(20,21)18-17-15-5-3-2-4-13(15)8-11-16(17)19/h2-11,18-19H,1H3
PCBioAssay
n/an/a 1.61E+4n/an/an/an/an/an/a
Burnham Center for Chemical Genomics
Curated by PubChem BioAssay
Assay Description
Data Source: Sanford-Burnham Center for Chemical Genomics (SBCCG) Source Affiliation: Sanford-Burnham Medical Research Institute (SBMRI, San Diego, C...
PubChem Bioassay (2011)
BindingDB Entry DOI: 10.7270/Q2W094D4