null
SMILES: O=[#6]-c1ccc(\[#6]=[#6](/C#N)C#N)cc1
InChI Key: InChIKey=CLUMTHHORUVBIQ-UHFFFAOYSA-N
Activity Spreadsheet -- Enzyme Inhibition Constant Data from BindingDB
Found 1 hit for monomerid = 4337
Trg + Lig
Ki
nM
ΔG°
kcal/mole
IC50
nM
Kd
nM
EC50/IC50
nM
koff
s-1
kon
M-1s-1
pHTemp
°C
Epidermal growth factor receptor
(Homo sapiens (Human))
BDBM4337
(2-[(4-formylphenyl)methylidene]propanedinitrile | ...)
Show SMILES O=[#6]-c1ccc(\[#6]=[#6](/C#N)C#N)cc1
Show InChI InChI=1S/C11H6N2O/c12-6-11(7-13)5-9-1-3-10(8-14)4-2-9/h1-5,8H
2.00E+4 -6.34 6.00E+4n/an/an/an/a7.622
Hebrew University of Jerusalem
Assay Description
The activity of EGFR, preactivated with EGF, is measured by its ability to transfer terminal phosphate from [gamma-32P]ATP to poly(GAT) substrate.
J Med Chem 32: 2344-52 (1989)
Article DOI: 10.1021/jm00130a020
BindingDB Entry DOI: 10.7270/Q2G44NHF