BDBM43386 (E)-1-(2-prop-2-enylsulfanylbenzimidazol-1-yl)-3-(3,4,5-trimethoxyphenyl)prop-2-en-1-one::(E)-1-[2-(allylthio)benzimidazol-1-yl]-3-(3,4,5-trimethoxyphenyl)prop-2-en-1-one::(E)-1-[2-(prop-2-enylthio)-1-benzimidazolyl]-3-(3,4,5-trimethoxyphenyl)-2-propen-1-one::2-(allylthio)-1-[3-(3,4,5-trimethoxyphenyl)acryloyl]-1H-benzimidazole::MLS000577033::SMR000198113::cid_5737516
SMILES: COc1cc(\C=C\C(=O)n2c(SCC=C)nc3ccccc23)cc(OC)c1OC
InChI Key: InChIKey=JMBYFKBGOMJGFM-ZHACJKMWSA-N
Data: 3 IC50  4 EC50
Activity Spreadsheet -- Enzyme Inhibition Constant Data from BindingDB
Found 7 hits for monomerid = 43386
Trg + Lig
Ki
nM
ΔG°
kcal/mole
IC50
nM
Kd
nM
EC50/IC50
nM
koff
s-1
kon
M-1s-1
pHTemp
°C
E3 ubiquitin-protein ligase Mdm2
(Homo sapiens (Human))
BDBM43386
((E)-1-(2-prop-2-enylsulfanylbenzimidazol-1-yl)-3-(...)
Show SMILES COc1cc(\C=C\C(=O)n2c(SCC=C)nc3ccccc23)cc(OC)c1OC
Show InChI InChI=1S/C22H22N2O4S/c1-5-12-29-22-23-16-8-6-7-9-17(16)24(22)20(25)11-10-15-13-18(26-2)21(28-4)19(14-15)27-3/h5-11,13-14H,1,12H2,2-4H3/b11-10+
NCI pathway
Reactome pathway
PCBioAssay
n/an/an/an/a 270n/an/an/an/a
PCMD
Curated by PubChem BioAssay
Assay Description
Molecular Library Screening Center Network (MLSCN) Penn Center for Molecular Discovery (PCMD) Assay Provider: Brent Stockwell, Columbia University ML...
PubChem Bioassay (2008)
BindingDB Entry DOI: 10.7270/Q21J984Z
E3 ubiquitin-protein ligase Mdm2
(Homo sapiens (Human))
BDBM43386
((E)-1-(2-prop-2-enylsulfanylbenzimidazol-1-yl)-3-(...)
Show SMILES COc1cc(\C=C\C(=O)n2c(SCC=C)nc3ccccc23)cc(OC)c1OC
Show InChI InChI=1S/C22H22N2O4S/c1-5-12-29-22-23-16-8-6-7-9-17(16)24(22)20(25)11-10-15-13-18(26-2)21(28-4)19(14-15)27-3/h5-11,13-14H,1,12H2,2-4H3/b11-10+
NCI pathway
Reactome pathway
PCBioAssay
n/an/an/an/a 1.16E+3n/an/an/an/a
PCMD
Curated by PubChem BioAssay
Assay Description
Molecular Library Screening Center Network (MLSCN) Penn Center for Molecular Discovery (PCMD) Assay Provider: Brent Stockwell, Columbia University ML...
PubChem Bioassay (2008)
BindingDB Entry DOI: 10.7270/Q2KW5DG0
E3 ubiquitin-protein ligase Mdm2
(Homo sapiens (Human))
BDBM43386
((E)-1-(2-prop-2-enylsulfanylbenzimidazol-1-yl)-3-(...)
Show SMILES COc1cc(\C=C\C(=O)n2c(SCC=C)nc3ccccc23)cc(OC)c1OC
Show InChI InChI=1S/C22H22N2O4S/c1-5-12-29-22-23-16-8-6-7-9-17(16)24(22)20(25)11-10-15-13-18(26-2)21(28-4)19(14-15)27-3/h5-11,13-14H,1,12H2,2-4H3/b11-10+
NCI pathway
Reactome pathway
PCBioAssay
n/an/an/an/a 1.50E+6n/an/an/an/a
PCMD
Curated by PubChem BioAssay
Assay Description
Molecular Library Screening Center Network (MLSCN) Penn Center for Molecular Discovery (PCMD) Assay Provider: Brent Stockwell, Columbia University ML...
PubChem Bioassay (2008)
BindingDB Entry DOI: 10.7270/Q2G73C3D
DNA damage-inducible transcript 3 protein
(Mus musculus)
BDBM43386
((E)-1-(2-prop-2-enylsulfanylbenzimidazol-1-yl)-3-(...)
Show SMILES COc1cc(\C=C\C(=O)n2c(SCC=C)nc3ccccc23)cc(OC)c1OC
Show InChI InChI=1S/C22H22N2O4S/c1-5-12-29-22-23-16-8-6-7-9-17(16)24(22)20(25)11-10-15-13-18(26-2)21(28-4)19(14-15)27-3/h5-11,13-14H,1,12H2,2-4H3/b11-10+
PCBioAssay
n/an/a 4.56E+3n/an/an/an/an/an/a
Emory University Molecular Libraries Screening Center
Curated by PubChem BioAssay
Assay Description
NIH Molecular Libraries Screening Centers Network [MLSCN] Emory Chemical Biology Discovery Center in MLSCN Assay provider: Dr. Randal Kaufman, Univer...
PubChem Bioassay (2011)
BindingDB Entry DOI: 10.7270/Q28C9TQN
DNA damage-inducible transcript 3 protein
(Mus musculus)
BDBM43386
((E)-1-(2-prop-2-enylsulfanylbenzimidazol-1-yl)-3-(...)
Show SMILES COc1cc(\C=C\C(=O)n2c(SCC=C)nc3ccccc23)cc(OC)c1OC
Show InChI InChI=1S/C22H22N2O4S/c1-5-12-29-22-23-16-8-6-7-9-17(16)24(22)20(25)11-10-15-13-18(26-2)21(28-4)19(14-15)27-3/h5-11,13-14H,1,12H2,2-4H3/b11-10+
PCBioAssay
n/an/a 4.56E+3n/an/an/an/an/an/a
Emory University Molecular Libraries Screening Center
Curated by PubChem BioAssay
Assay Description
NIH Molecular Libraries Screening Centers Network [MLSCN] Emory Chemical Biology Discovery Center in MLSCN Assay provider: Dr. Randal Kaufman, Univer...
PubChem Bioassay (2010)
BindingDB Entry DOI: 10.7270/Q2PC30VZ
XBP1
(Homo sapiens (Human))
BDBM43386
((E)-1-(2-prop-2-enylsulfanylbenzimidazol-1-yl)-3-(...)
Show SMILES COc1cc(\C=C\C(=O)n2c(SCC=C)nc3ccccc23)cc(OC)c1OC
Show InChI InChI=1S/C22H22N2O4S/c1-5-12-29-22-23-16-8-6-7-9-17(16)24(22)20(25)11-10-15-13-18(26-2)21(28-4)19(14-15)27-3/h5-11,13-14H,1,12H2,2-4H3/b11-10+
PCBioAssay
n/an/a 1.65E+3n/an/an/an/an/an/a
Emory University Molecular Libraries Screening Center
Curated by PubChem BioAssay
Assay Description
NIH Molecular Libraries Screening Centers Network [MLSCN] Emory Chemical Biology Discovery Center in MLSCN Assay provider: Dr. Randal Kaufman, Univer...
PubChem Bioassay (2011)
BindingDB Entry DOI: 10.7270/Q2NK3CGB
Hsf1 protein
(Mus musculus)
BDBM43386
((E)-1-(2-prop-2-enylsulfanylbenzimidazol-1-yl)-3-(...)
Show SMILES COc1cc(\C=C\C(=O)n2c(SCC=C)nc3ccccc23)cc(OC)c1OC
Show InChI InChI=1S/C22H22N2O4S/c1-5-12-29-22-23-16-8-6-7-9-17(16)24(22)20(25)11-10-15-13-18(26-2)21(28-4)19(14-15)27-3/h5-11,13-14H,1,12H2,2-4H3/b11-10+
PCBioAssay
n/an/an/an/a 1.03E+4n/an/an/an/a
Broad Institute
Curated by PubChem BioAssay
Assay Description
Keywords: Heat Shock Factor-1 (HSF-1), Stress Response, MG132, NIH3T3, Luminescence Assay Overview: Modified NIH3T3, transformed to express firefly...
PubChem Bioassay (2010)
BindingDB Entry DOI: 10.7270/Q2MW2FKX