BDBM43437 (6-methyl-3-nitro-2-oxidanylidene-1H-pyridin-4-yl) benzoate::(6-methyl-3-nitro-2-oxo-1H-pyridin-4-yl) benzoate::MLS000680115::SMR000324732::benzoic acid (2-keto-6-methyl-3-nitro-1H-pyridin-4-yl) ester::benzoic acid (6-methyl-3-nitro-2-oxo-1H-pyridin-4-yl) ester::cid_7150639
SMILES: Cc1cc(OC(=O)c2ccccc2)c([N+]([O-])=O)c(=O)[nH]1
InChI Key: InChIKey=CZEWKOCTSHLPAZ-UHFFFAOYSA-N
Data: 1 EC50
Activity Spreadsheet -- Enzyme Inhibition Constant Data from BindingDB
Found 1 hit for monomerid = 43437
Trg + Lig
Ki
nM
ΔG°
kcal/mole
IC50
nM
Kd
nM
EC50/IC50
nM
koff
s-1
kon
M-1s-1
pHTemp
°C
MDM2-MDMX
(Homo sapiens (Human))
BDBM43437
((6-methyl-3-nitro-2-oxidanylidene-1H-pyridin-4-yl)...)
Show SMILES Cc1cc(OC(=O)c2ccccc2)c([N+]([O-])=O)c(=O)[nH]1
Show InChI InChI=1S/C13H10N2O5/c1-8-7-10(11(15(18)19)12(16)14-8)20-13(17)9-5-3-2-4-6-9/h2-7H,1H3,(H,14,16)
NCI pathway
Reactome pathway
PCBioAssay
n/an/an/an/a 10n/an/an/an/a
PCMD
Curated by PubChem BioAssay
Assay Description
Molecular Library Screening Center Network (MLSCN) Penn Center for Molecular Discovery (PCMD) Assay Provider: Brent Stockwell, Columbia University ML...
PubChem Bioassay (2008)
BindingDB Entry DOI: 10.7270/Q21J984Z