BDBM43464 MLS000755897::N'-[3-chloro-5-(trifluoromethyl)-2-pyridinyl]-4-methoxy-N'-methylbenzenesulfonohydrazide::N'-[3-chloranyl-5-(trifluoromethyl)pyridin-2-yl]-4-methoxy-N'-methyl-benzenesulfonohydrazide::N'-[3-chloro-5-(trifluoromethyl)-2-pyridinyl]-4-methoxy-N'-methylbenzenesulfonohydrazide::N'-[3-chloro-5-(trifluoromethyl)-2-pyridyl]-4-methoxy-N'-methyl-benzenesulfonohydrazide::N'-[3-chloro-5-(trifluoromethyl)pyridin-2-yl]-4-methoxy-N'-methylbenzenesulfonohydrazide::SMR000337920::cid_1476492
SMILES: COc1ccc(cc1)S(=O)(=O)NN(C)c1ncc(cc1Cl)C(F)(F)F
InChI Key: InChIKey=IKHPFBACYMOZSP-UHFFFAOYSA-N
Data: 1 EC50
Activity Spreadsheet -- Enzyme Inhibition Constant Data from BindingDB
Found 1 hit for monomerid = 43464
Trg + Lig
Ki
nM
ΔG°
kcal/mole
IC50
nM
Kd
nM
EC50/IC50
nM
koff
s-1
kon
M-1s-1
pHTemp
°C
MDM2-MDMX
(Homo sapiens (Human))
BDBM43464
(MLS000755897 | N'-[3-chloro-5-(trifluoromethyl...)
Show SMILES COc1ccc(cc1)S(=O)(=O)NN(C)c1ncc(cc1Cl)C(F)(F)F
Show InChI InChI=1S/C14H13ClF3N3O3S/c1-21(13-12(15)7-9(8-19-13)14(16,17)18)20-25(22,23)11-5-3-10(24-2)4-6-11/h3-8,20H,1-2H3
NCI pathway
Reactome pathway
PCBioAssay
n/an/an/an/a 380n/an/an/an/a
PCMD
Curated by PubChem BioAssay
Assay Description
Molecular Library Screening Center Network (MLSCN) Penn Center for Molecular Discovery (PCMD) Assay Provider: Brent Stockwell, Columbia University ML...
PubChem Bioassay (2008)
BindingDB Entry DOI: 10.7270/Q21J984Z