null
SMILES: Cc1cc(Cl)ccc1NC(=S)Nc1ccccn1
InChI Key: InChIKey=BMYHYBZRMXACAK-UHFFFAOYSA-N
Activity Spreadsheet -- Enzyme Inhibition Constant Data from BindingDB
Found 2 hits for monomerid = 43762
Trg + Lig
Ki
nM
ΔG°
kcal/mole
IC50
nM
Kd
nM
EC50/IC50
nM
koff
s-1
kon
M-1s-1
pHTemp
°C
G2/mitotic-specific cyclin-B1
(Homo sapiens (Human))
BDBM43762
(1-(4-chloranyl-2-methyl-phenyl)-3-pyridin-2-yl-thi...)
Show SMILES Cc1cc(Cl)ccc1NC(=S)Nc1ccccn1
Show InChI InChI=1S/C13H12ClN3S/c1-9-8-10(14)5-6-11(9)16-13(18)17-12-4-2-3-7-15-12/h2-8H,1H3,(H2,15,16,17,18)
NCI pathway
Reactome pathway
PCBioAssay
n/an/an/an/a>4.98E+4n/an/an/an/a
The Scripps Research Institute Molecular Screening Center
Curated by PubChem BioAssay
Assay Description
Source (MLPCN Center Name): The Scripps Research Institute Molecular Screening Center Center Affiliation: The Scripps Research Institute (TSRI) Assay...
PubChem Bioassay (2008)
BindingDB Entry DOI: 10.7270/Q2833QDB
Wee1-like protein kinase
(Homo sapiens (Human))
BDBM43762
(1-(4-chloranyl-2-methyl-phenyl)-3-pyridin-2-yl-thi...)
Show SMILES Cc1cc(Cl)ccc1NC(=S)Nc1ccccn1
Show InChI InChI=1S/C13H12ClN3S/c1-9-8-10(14)5-6-11(9)16-13(18)17-12-4-2-3-7-15-12/h2-8H,1H3,(H2,15,16,17,18)
NCI pathway
Reactome pathway
PCBioAssay
n/an/an/an/a>4.98E+4n/an/an/an/a
The Scripps Research Institute Molecular Screening Center
Curated by PubChem BioAssay
Assay Description
Source (MLPCN Center Name): The Scripps Research Institute Molecular Screening Center Center Affiliation: The Scripps Research Institute (TSRI) Assay...
PubChem Bioassay (2008)
BindingDB Entry DOI: 10.7270/Q2CV4G4R