BDBM43923 1-(2-Methyl-2,3-dihydro-indol-1-yl)-2-(5-phenylaminomethyl-[1,3,4]oxadiazol-2-ylsulfanyl)-ethanone::1-(2-methyl-2,3-dihydroindol-1-yl)-2-[[5-(phenylazanylmethyl)-1,3,4-oxadiazol-2-yl]sulfanyl]ethanone::2-[[5-(anilinomethyl)-1,3,4-oxadiazol-2-yl]sulfanyl]-1-(2-methyl-2,3-dihydroindol-1-yl)ethanone::2-[[5-(anilinomethyl)-1,3,4-oxadiazol-2-yl]thio]-1-(2-methyl-2,3-dihydroindol-1-yl)ethanone::2-[[5-(anilinomethyl)-1,3,4-oxadiazol-2-yl]thio]-1-(2-methylindolin-1-yl)ethanone::MLS000034653::SMR000002885::cid_652858
SMILES: CC1Cc2ccccc2N1C(=O)CSc1nnc(CNc2ccccc2)o1
InChI Key: InChIKey=HTSQERUSLPZCCK-UHFFFAOYSA-N
Data: 3 EC50
Activity Spreadsheet -- Enzyme Inhibition Constant Data from BindingDB
Found 3 hits for monomerid = 43923
Trg + Lig
Ki
nM
ΔG°
kcal/mole
IC50
nM
Kd
nM
EC50/IC50
nM
koff
s-1
kon
M-1s-1
pHTemp
°C
electroneutral potassium-chloride cotransporter KCC2
(Homo sapiens (Human))
BDBM43923
(1-(2-Methyl-2,3-dihydro-indol-1-yl)-2-(5-phenylami...)
Show SMILES CC1Cc2ccccc2N1C(=O)CSc1nnc(CNc2ccccc2)o1
Show InChI InChI=1S/C20H20N4O2S/c1-14-11-15-7-5-6-10-17(15)24(14)19(25)13-27-20-23-22-18(26-20)12-21-16-8-3-2-4-9-16/h2-10,14,21H,11-13H2,1H3
Reactome pathway
PCBioAssay
n/an/an/an/a 941n/an/an/an/a
Vanderbilt Screening Center for GPCRs, Ion Channels and Transporters
Curated by PubChem BioAssay
Assay Description
Vanderbilt Screening Center for GPCRs, Ion Channels and Transporters Assay Provider: Eric Delpire Assay Provider Affliation: Vanderbilt University Gr...
PubChem Bioassay (2009)
BindingDB Entry DOI: 10.7270/Q2TX3CSC
electroneutral potassium-chloride cotransporter KCC2
(Homo sapiens (Human))
BDBM43923
(1-(2-Methyl-2,3-dihydro-indol-1-yl)-2-(5-phenylami...)
Show SMILES CC1Cc2ccccc2N1C(=O)CSc1nnc(CNc2ccccc2)o1
Show InChI InChI=1S/C20H20N4O2S/c1-14-11-15-7-5-6-10-17(15)24(14)19(25)13-27-20-23-22-18(26-20)12-21-16-8-3-2-4-9-16/h2-10,14,21H,11-13H2,1H3
Reactome pathway
PCBioAssay
n/an/an/an/a 137n/an/an/an/a
Vanderbilt Screening Center for GPCRs, Ion Channels and Transporters
Curated by PubChem BioAssay
Assay Description
Vanderbilt Screening Center for GPCRs, Ion Channels and Transporters Assay Provider: Eric Delpire Assay Provider Affliation: Vanderbilt University Gr...
PubChem Bioassay (2009)
BindingDB Entry DOI: 10.7270/Q2M32T6M
electroneutral potassium-chloride cotransporter KCC2
(Homo sapiens (Human))
BDBM43923
(1-(2-Methyl-2,3-dihydro-indol-1-yl)-2-(5-phenylami...)
Show SMILES CC1Cc2ccccc2N1C(=O)CSc1nnc(CNc2ccccc2)o1
Show InChI InChI=1S/C20H20N4O2S/c1-14-11-15-7-5-6-10-17(15)24(14)19(25)13-27-20-23-22-18(26-20)12-21-16-8-3-2-4-9-16/h2-10,14,21H,11-13H2,1H3
Reactome pathway
PCBioAssay
n/an/an/an/a 1.85E+4n/an/an/an/a
Vanderbilt Screening Center for GPCRs, Ion Channels and Transporters
Curated by PubChem BioAssay
Assay Description
Vanderbilt Screening Center for GPCRs, Ion Channels and Transporters Assay Provider: Eric Delpire Assay Provider Affliation: Vanderbilt University Gr...
PubChem Bioassay (2009)
BindingDB Entry DOI: 10.7270/Q2Q52N1X