BDBM4400 4-Anilidoquinazoline deriv. 15b::6-methyl-N-[3-(trifluoromethyl)phenyl]quinazolin-4-amine
SMILES: Cc1ccc2ncnc(Nc3cccc(c3)C(F)(F)F)c2c1
InChI Key: InChIKey=NFEUTOJRUZZNQS-UHFFFAOYSA-N
Data: 1 IC50
Activity Spreadsheet -- Enzyme Inhibition Constant Data from BindingDB
Found 1 hit for monomerid = 4400
Trg + Lig
Ki
nM
ΔG°
kcal/mole
IC50
nM
Kd
nM
EC50/IC50
nM
koff
s-1
kon
M-1s-1
pHTemp
°C
Epidermal growth factor receptor
(Homo sapiens (Human))
BDBM4400
(4-Anilidoquinazoline deriv. 15b | 6-methyl-N-[3-(t...)
Show SMILES Cc1ccc2ncnc(Nc3cccc(c3)C(F)(F)F)c2c1
Show InChI InChI=1S/C16H12F3N3/c1-10-5-6-14-13(7-10)15(21-9-20-14)22-12-4-2-3-11(8-12)16(17,18)19/h2-9H,1H3,(H,20,21,22)
n/an/a 2.10E+3n/an/an/an/a7.622
Hebrew University of Jerusalem
Assay Description
The activity of EGFR, preactivated with EGF, is measured by its ability to transfer terminal phosphate from [gamma-32P]ATP to poly(GAT) substrate.
Bioorg Med Chem 4: 1203-7 (1996)
Article DOI: 10.1016/0968-0896(96)00107-1
BindingDB Entry DOI: 10.7270/Q2BC3WR8