null
SMILES: NC(=S)NN=C1C(=O)N(Cc2ccccc2)c2ccccc12
InChI Key: InChIKey=CFXISAYTAYDGKB-UHFFFAOYSA-N
Activity Spreadsheet -- Enzyme Inhibition Constant Data from BindingDB
Found 2 hits for monomerid = 44030
Trg + Lig
Ki
nM
ΔG°
kcal/mole
IC50
nM
Kd
nM
EC50/IC50
nM
koff
s-1
kon
M-1s-1
pHTemp
°C
Solute carrier family 12 member 5
(Homo sapiens (Human))
BDBM44030
(1-[(Z)-[2-oxidanylidene-1-(phenylmethyl)indol-3-yl...)
Show SMILES NC(=S)NN=C1C(=O)N(Cc2ccccc2)c2ccccc12 |w:4.3|
Show InChI InChI=1S/C16H14N4OS/c17-16(22)19-18-14-12-8-4-5-9-13(12)20(15(14)21)10-11-6-2-1-3-7-11/h1-9H,10H2,(H3,17,19,22)
Reactome pathway
PCBioAssay
n/an/an/an/a 295n/an/an/an/a
Vanderbilt Screening Center for GPCRs, Ion Channels and Transporters
Curated by PubChem BioAssay
Assay Description
Vanderbilt Screening Center for GPCRs, Ion Channels and Transporters Assay Provider: Eric Delpire Assay Provider Affliation: Vanderbilt University Gr...
PubChem Bioassay (2009)
BindingDB Entry DOI: 10.7270/Q2TX3CSC
Solute carrier family 12 member 5
(Homo sapiens (Human))
BDBM44030
(1-[(Z)-[2-oxidanylidene-1-(phenylmethyl)indol-3-yl...)
Show SMILES NC(=S)NN=C1C(=O)N(Cc2ccccc2)c2ccccc12 |w:4.3|
Show InChI InChI=1S/C16H14N4OS/c17-16(22)19-18-14-12-8-4-5-9-13(12)20(15(14)21)10-11-6-2-1-3-7-11/h1-9H,10H2,(H3,17,19,22)
Reactome pathway
PCBioAssay
n/an/an/an/a 618n/an/an/an/a
Vanderbilt Screening Center for GPCRs, Ion Channels and Transporters
Curated by PubChem BioAssay
Assay Description
Vanderbilt Screening Center for GPCRs, Ion Channels and Transporters Assay Provider: Eric Delpire Assay Provider Affliation: Vanderbilt University Gr...
PubChem Bioassay (2009)
BindingDB Entry DOI: 10.7270/Q2Q52N1X