null
SMILES: CN(c1ccccc1)c1ccc(\C=C(/CCC(O)=O)c2nc3ccccc3s2)cc1[N+]([O-])=O
InChI Key: InChIKey=XQILZURWAUDZSB-OBGWFSINSA-N
Activity Spreadsheet -- Enzyme Inhibition Constant Data from BindingDB
Found 7 hits for monomerid = 44073
Trg + Lig
Ki
nM
ΔG°
kcal/mole
IC50
nM
Kd
nM
EC50/IC50
nM
koff
s-1
kon
M-1s-1
pHTemp
°C
Solute carrier family 12 member 5
(Homo sapiens (Human))
BDBM44073
((E)-4-(1,3-benzothiazol-2-yl)-5-[4-(N-methylanilin...)
Show SMILES CN(c1ccccc1)c1ccc(\C=C(/CCC(O)=O)c2nc3ccccc3s2)cc1[N+]([O-])=O
Show InChI InChI=1S/C25H21N3O4S/c1-27(19-7-3-2-4-8-19)21-13-11-17(16-22(21)28(31)32)15-18(12-14-24(29)30)25-26-20-9-5-6-10-23(20)33-25/h2-11,13,15-16H,12,14H2,1H3,(H,29,30)/b18-15+
Reactome pathway
PCBioAssay
n/an/an/an/a 8.17E+3n/an/an/an/a
Vanderbilt Screening Center for GPCRs, Ion Channels and Transporters
Curated by PubChem BioAssay
Assay Description
Vanderbilt Screening Center for GPCRs, Ion Channels and Transporters Assay Provider: Eric Delpire Assay Provider Affliation: Vanderbilt University Gr...
PubChem Bioassay (2009)
BindingDB Entry DOI: 10.7270/Q2TX3CSC
Induced myeloid leukemia cell differentiation protein Mcl-1
(Homo sapiens (Human))
BDBM44073
((E)-4-(1,3-benzothiazol-2-yl)-5-[4-(N-methylanilin...)
Show SMILES CN(c1ccccc1)c1ccc(\C=C(/CCC(O)=O)c2nc3ccccc3s2)cc1[N+]([O-])=O
Show InChI InChI=1S/C25H21N3O4S/c1-27(19-7-3-2-4-8-19)21-13-11-17(16-22(21)28(31)32)15-18(12-14-24(29)30)25-26-20-9-5-6-10-23(20)33-25/h2-11,13,15-16H,12,14H2,1H3,(H,29,30)/b18-15+
NCI pathway
PCBioAssay
n/an/a 2.27E+3n/an/an/an/an/an/a
Emory University Molecular Libraries Screening Center
Curated by PubChem BioAssay
Assay Description
NIH Molecular Libraries Screening Centers Network [MLSCN] Emory Chemical Biology Discovery Center in MLSCN Assay provider: Nikolovska-Coleska, Univer...
PubChem Bioassay (2008)
BindingDB Entry DOI: 10.7270/Q23X8539
SUMO-conjugating enzyme UBC9
(Homo sapiens (Human))
BDBM44073
((E)-4-(1,3-benzothiazol-2-yl)-5-[4-(N-methylanilin...)
Show SMILES CN(c1ccccc1)c1ccc(\C=C(/CCC(O)=O)c2nc3ccccc3s2)cc1[N+]([O-])=O
Show InChI InChI=1S/C25H21N3O4S/c1-27(19-7-3-2-4-8-19)21-13-11-17(16-22(21)28(31)32)15-18(12-14-24(29)30)25-26-20-9-5-6-10-23(20)33-25/h2-11,13,15-16H,12,14H2,1H3,(H,29,30)/b18-15+
Reactome pathway
PCBioAssay
n/an/a 1.65E+3n/an/an/an/an/an/a
Burnham Center for Chemical Genomics
Curated by PubChem BioAssay
Assay Description
Data Source: Sanford-Burnham Center for Chemical Genomics (SBCCG) Source Affiliation: Sanford-Burnham Medical Research Institute (SBMRI, San Diego, C...
PubChem Bioassay (2010)
BindingDB Entry DOI: 10.7270/Q2V986G8
DNA (cytosine-5)-methyltransferase 1
(Homo sapiens (Human))
BDBM44073
((E)-4-(1,3-benzothiazol-2-yl)-5-[4-(N-methylanilin...)
Show SMILES CN(c1ccccc1)c1ccc(\C=C(/CCC(O)=O)c2nc3ccccc3s2)cc1[N+]([O-])=O
Show InChI InChI=1S/C25H21N3O4S/c1-27(19-7-3-2-4-8-19)21-13-11-17(16-22(21)28(31)32)15-18(12-14-24(29)30)25-26-20-9-5-6-10-23(20)33-25/h2-11,13,15-16H,12,14H2,1H3,(H,29,30)/b18-15+
PCBioAssay
n/an/a 5.34E+3n/an/an/an/an/an/a
Burnham Center for Chemical Genomics
Curated by PubChem BioAssay
Assay Description
Data Source: Sanford-Burnham Center for Chemical Genomics (SBCCG) Source Affiliation: Sanford-Burnham Medical Research Institute (SBMRI, San Diego, C...
PubChem Bioassay (2012)
BindingDB Entry DOI: 10.7270/Q2NC5ZRN
Cysteine protease ATG4B
(Homo sapiens (Human))
BDBM44073
((E)-4-(1,3-benzothiazol-2-yl)-5-[4-(N-methylanilin...)
Show SMILES CN(c1ccccc1)c1ccc(\C=C(/CCC(O)=O)c2nc3ccccc3s2)cc1[N+]([O-])=O
Show InChI InChI=1S/C25H21N3O4S/c1-27(19-7-3-2-4-8-19)21-13-11-17(16-22(21)28(31)32)15-18(12-14-24(29)30)25-26-20-9-5-6-10-23(20)33-25/h2-11,13,15-16H,12,14H2,1H3,(H,29,30)/b18-15+
PCBioAssay
n/an/a 4.31E+3n/an/an/an/an/an/a
Burnham Center for Chemical Genomics
Curated by PubChem BioAssay
Assay Description
Data Source: Sanford-Burnham Center for Chemical Genomics (SBCCG) Source Affiliation: Sanford-Burnham Medical Research Institute (SBMRI, San Diego, C...
PubChem Bioassay (2011)
BindingDB Entry DOI: 10.7270/Q2BZ64H1
Phospholipase A2
(Homo sapiens (Human))
BDBM44073
((E)-4-(1,3-benzothiazol-2-yl)-5-[4-(N-methylanilin...)
Show SMILES CN(c1ccccc1)c1ccc(\C=C(/CCC(O)=O)c2nc3ccccc3s2)cc1[N+]([O-])=O
Show InChI InChI=1S/C25H21N3O4S/c1-27(19-7-3-2-4-8-19)21-13-11-17(16-22(21)28(31)32)15-18(12-14-24(29)30)25-26-20-9-5-6-10-23(20)33-25/h2-11,13,15-16H,12,14H2,1H3,(H,29,30)/b18-15+
Reactome pathway
PCBioAssay
n/an/a 5.31E+3n/an/an/an/an/an/a
Burnham Center for Chemical Genomics
Curated by PubChem BioAssay
Assay Description
Data Source: Sanford-Burnham Center for Chemical Genomics (SBCCG) Source Affiliation: Sanford-Burnham Medical Research Institute (SBMRI, San Diego, C...
PubChem Bioassay (2011)
BindingDB Entry DOI: 10.7270/Q26M35BC
SUMO-activating enzyme subunit 1
(Homo sapiens (Human))
BDBM44073
((E)-4-(1,3-benzothiazol-2-yl)-5-[4-(N-methylanilin...)
Show SMILES CN(c1ccccc1)c1ccc(\C=C(/CCC(O)=O)c2nc3ccccc3s2)cc1[N+]([O-])=O
Show InChI InChI=1S/C25H21N3O4S/c1-27(19-7-3-2-4-8-19)21-13-11-17(16-22(21)28(31)32)15-18(12-14-24(29)30)25-26-20-9-5-6-10-23(20)33-25/h2-11,13,15-16H,12,14H2,1H3,(H,29,30)/b18-15+
Reactome pathway
PCBioAssay
n/an/a 1.68E+4n/an/an/an/an/an/a
Burnham Center for Chemical Genomics
Curated by PubChem BioAssay
Assay Description
Data Source: Sanford-Burnham Center for Chemical Genomics (SBCCG) Source Affiliation: Sanford-Burnham Medical Research Institute (SBMRI, San Diego, C...
PubChem Bioassay (2010)
BindingDB Entry DOI: 10.7270/Q2BP0175