null
SMILES: Sc1nnc(Cc2cccc3ccccc23)o1
InChI Key: InChIKey=YLRFXLNGPBLJIH-UHFFFAOYSA-N
Activity Spreadsheet -- Enzyme Inhibition Constant Data from BindingDB
Found 3 hits for monomerid = 44078
Trg + Lig
Ki
nM
ΔG°
kcal/mole
IC50
nM
Kd
nM
EC50/IC50
nM
koff
s-1
kon
M-1s-1
pHTemp
°C
Solute carrier family 12 member 5
(Homo sapiens (Human))
BDBM44078
(5-(1-naphthalenylmethyl)-3H-1,3,4-oxadiazole-2-thi...)
Show SMILES Sc1nnc(Cc2cccc3ccccc23)o1
Show InChI InChI=1S/C13H10N2OS/c17-13-15-14-12(16-13)8-10-6-3-5-9-4-1-2-7-11(9)10/h1-7H,8H2,(H,15,17)
Reactome pathway
PCBioAssay
n/an/an/an/a 269n/an/an/an/a
Vanderbilt Screening Center for GPCRs, Ion Channels and Transporters
Curated by PubChem BioAssay
Assay Description
Vanderbilt Screening Center for GPCRs, Ion Channels and Transporters Assay Provider: Eric Delpire Assay Provider Affliation: Vanderbilt University Gr...
PubChem Bioassay (2009)
BindingDB Entry DOI: 10.7270/Q2Q52N1X
Solute carrier family 12 member 5
(Homo sapiens (Human))
BDBM44078
(5-(1-naphthalenylmethyl)-3H-1,3,4-oxadiazole-2-thi...)
Show SMILES Sc1nnc(Cc2cccc3ccccc23)o1
Show InChI InChI=1S/C13H10N2OS/c17-13-15-14-12(16-13)8-10-6-3-5-9-4-1-2-7-11(9)10/h1-7H,8H2,(H,15,17)
Reactome pathway
PCBioAssay
n/an/an/an/a 283n/an/an/an/a
Vanderbilt Screening Center for GPCRs, Ion Channels and Transporters
Curated by PubChem BioAssay
Assay Description
Vanderbilt Screening Center for GPCRs, Ion Channels and Transporters Assay Provider: Eric Delpire Assay Provider Affliation: Vanderbilt University Gr...
PubChem Bioassay (2009)
BindingDB Entry DOI: 10.7270/Q2M32T6M
Solute carrier family 12 member 5
(Homo sapiens (Human))
BDBM44078
(5-(1-naphthalenylmethyl)-3H-1,3,4-oxadiazole-2-thi...)
Show SMILES Sc1nnc(Cc2cccc3ccccc23)o1
Show InChI InChI=1S/C13H10N2OS/c17-13-15-14-12(16-13)8-10-6-3-5-9-4-1-2-7-11(9)10/h1-7H,8H2,(H,15,17)
Reactome pathway
PCBioAssay
n/an/an/an/a 304n/an/an/an/a
Vanderbilt Screening Center for GPCRs, Ion Channels and Transporters
Curated by PubChem BioAssay
Assay Description
Vanderbilt Screening Center for GPCRs, Ion Channels and Transporters Assay Provider: Eric Delpire Assay Provider Affliation: Vanderbilt University Gr...
PubChem Bioassay (2009)
BindingDB Entry DOI: 10.7270/Q2TX3CSC