BDBM44162 4-Chloro-N-[N'-(pyrazine-2-carbonyl)-hydrazinocarbothioyl]-benzamide::4-chloranyl-N-[(pyrazin-2-ylcarbonylamino)carbamothioyl]benzamide::4-chloro-N-[(pyrazine-2-carbonylamino)carbamothioyl]benzamide::4-chloro-N-[(pyrazinoylamino)thiocarbamoyl]benzamide::4-chloro-N-[[[oxo(2-pyrazinyl)methyl]hydrazo]-sulfanylidenemethyl]benzamide::MLS000769396::SMR000434130::cid_1875855
SMILES: Clc1ccc(cc1)C(=O)NC(=S)NNC(=O)c1cnccn1
InChI Key: InChIKey=NXXKPLQWXUBUGR-UHFFFAOYSA-N
Data: 4 EC50
Activity Spreadsheet -- Enzyme Inhibition Constant Data from BindingDB
Found 4 hits for monomerid = 44162
Trg + Lig
Ki
nM
ΔG°
kcal/mole
IC50
nM
Kd
nM
EC50/IC50
nM
koff
s-1
kon
M-1s-1
pHTemp
°C
electroneutral potassium-chloride cotransporter KCC2
(Homo sapiens (Human))
BDBM44162
(4-Chloro-N-[N'-(pyrazine-2-carbonyl)-hydrazino...)
Show SMILES Clc1ccc(cc1)C(=O)NC(=S)NNC(=O)c1cnccn1
Show InChI InChI=1S/C13H10ClN5O2S/c14-9-3-1-8(2-4-9)11(20)17-13(22)19-18-12(21)10-7-15-5-6-16-10/h1-7H,(H,18,21)(H2,17,19,20,22)
Reactome pathway
PCBioAssay
n/an/an/an/a 1.30E+4n/an/an/an/a
Vanderbilt Screening Center for GPCRs, Ion Channels and Transporters
Curated by PubChem BioAssay
Assay Description
Vanderbilt Screening Center for GPCRs, Ion Channels and Transporters Assay Provider: Eric Delpire Assay Provider Affliation: Vanderbilt University Gr...
PubChem Bioassay (2009)
BindingDB Entry DOI: 10.7270/Q2Q52N1X
LAP4
(Saccharomyces cerevisiae)
BDBM44162
(4-Chloro-N-[N'-(pyrazine-2-carbonyl)-hydrazino...)
Show SMILES Clc1ccc(cc1)C(=O)NC(=S)NNC(=O)c1cnccn1
Show InChI InChI=1S/C13H10ClN5O2S/c14-9-3-1-8(2-4-9)11(20)17-13(22)19-18-12(21)10-7-15-5-6-16-10/h1-7H,(H,18,21)(H2,17,19,20,22)
PCBioAssay
n/an/an/an/a 1.75E+3n/an/an/an/a
NMMLSC
Curated by PubChem BioAssay
Assay Description
University of New Mexico Assay Overview: Assay Support: 1R03 MH086450-01 Project Title: Chemical Screen of TOR pathway GFP fusion proteins in S. ...
PubChem Bioassay (2010)
BindingDB Entry DOI: 10.7270/Q21R6P02
electroneutral potassium-chloride cotransporter KCC2
(Homo sapiens (Human))
BDBM44162
(4-Chloro-N-[N'-(pyrazine-2-carbonyl)-hydrazino...)
Show SMILES Clc1ccc(cc1)C(=O)NC(=S)NNC(=O)c1cnccn1
Show InChI InChI=1S/C13H10ClN5O2S/c14-9-3-1-8(2-4-9)11(20)17-13(22)19-18-12(21)10-7-15-5-6-16-10/h1-7H,(H,18,21)(H2,17,19,20,22)
Reactome pathway
PCBioAssay
n/an/an/an/a 9.74E+3n/an/an/an/a
Vanderbilt Screening Center for GPCRs, Ion Channels and Transporters
Curated by PubChem BioAssay
Assay Description
Vanderbilt Screening Center for GPCRs, Ion Channels and Transporters Assay Provider: Eric Delpire Assay Provider Affliation: Vanderbilt University Gr...
PubChem Bioassay (2009)
BindingDB Entry DOI: 10.7270/Q2M32T6M
electroneutral potassium-chloride cotransporter KCC2
(Homo sapiens (Human))
BDBM44162
(4-Chloro-N-[N'-(pyrazine-2-carbonyl)-hydrazino...)
Show SMILES Clc1ccc(cc1)C(=O)NC(=S)NNC(=O)c1cnccn1
Show InChI InChI=1S/C13H10ClN5O2S/c14-9-3-1-8(2-4-9)11(20)17-13(22)19-18-12(21)10-7-15-5-6-16-10/h1-7H,(H,18,21)(H2,17,19,20,22)
Reactome pathway
PCBioAssay
n/an/an/an/a 2.33E+4n/an/an/an/a
Vanderbilt Screening Center for GPCRs, Ion Channels and Transporters
Curated by PubChem BioAssay
Assay Description
Vanderbilt Screening Center for GPCRs, Ion Channels and Transporters Assay Provider: Eric Delpire Assay Provider Affliation: Vanderbilt University Gr...
PubChem Bioassay (2009)
BindingDB Entry DOI: 10.7270/Q2TX3CSC