BDBM44332 CHEMBL1622564::MLS-0391025.0001::cid_44182257::formic acid;(2S)-1-[(2S)-3-methyl-2-[[(2S)-2-(methylamino)-1-oxopropyl]amino]-1-oxobutyl]-N-(8-quinolinyl)-2-pyrrolidinecarboxamide::formic acid;(2S)-1-[(2S)-3-methyl-2-[[(2S)-2-(methylamino)propanoyl]amino]butanoyl]-N-(8-quinolyl)pyrrolidine-2-carboxamide::formic acid;(2S)-1-[(2S)-3-methyl-2-[[(2S)-2-(methylamino)propanoyl]amino]butanoyl]-N-quinolin-8-ylpyrrolidine-2-carboxamide::methanoic acid;(2S)-1-[(2S)-3-methyl-2-[[(2S)-2-(methylamino)propanoyl]amino]butanoyl]-N-quinolin-8-yl-pyrrolidine-2-carboxamide
SMILES: CN[C@@H](C)C(=O)N[C@@H](C(C)C)C(=O)N1CCC[C@H]1C(=O)Nc1cccc2cccnc12
InChI Key: InChIKey=ZZOADACMNMEUIP-SNRMKQJTSA-N
Data: 2 KI  2 IC50
Activity Spreadsheet -- Enzyme Inhibition Constant Data from BindingDB
Found 4 hits for monomerid = 44332
Trg + Lig
Ki
nM
ΔG°
kcal/mole
IC50
nM
Kd
nM
EC50/IC50
nM
koff
s-1
kon
M-1s-1
pHTemp
°C
E3 ubiquitin-protein ligase XIAP
(Homo sapiens (Human))
BDBM44332
(CHEMBL1622564 | MLS-0391025.0001 | cid_44182257 | ...)
Show SMILES CN[C@@H](C)C(=O)N[C@@H](C(C)C)C(=O)N1CCC[C@H]1C(=O)Nc1cccc2cccnc12
Show InChI InChI=1S/C23H31N5O3/c1-14(2)19(27-21(29)15(3)24-4)23(31)28-13-7-11-18(28)22(30)26-17-10-5-8-16-9-6-12-25-20(16)17/h5-6,8-10,12,14-15,18-19,24H,7,11,13H2,1-4H3,(H,26,30)(H,27,29)/t15-,18-,19-/m0/s1
420n/an/an/an/an/an/an/an/a
Sanford-Burnham Medical Research Institute
Curated by ChEMBL
Assay Description
Competitive inhibition of XIAP BIR3 domain by fluorescent polarization assay
Bioorg Med Chem Lett 21: 4332-6 (2011)
Article DOI: 10.1016/j.bmcl.2011.05.049
BindingDB Entry DOI: 10.7270/Q2S46SBD
E3 ubiquitin-protein ligase XIAP
(Homo sapiens (Human))
BDBM44332
(CHEMBL1622564 | MLS-0391025.0001 | cid_44182257 | ...)
Show SMILES CN[C@@H](C)C(=O)N[C@@H](C(C)C)C(=O)N1CCC[C@H]1C(=O)Nc1cccc2cccnc12
Show InChI InChI=1S/C23H31N5O3/c1-14(2)19(27-21(29)15(3)24-4)23(31)28-13-7-11-18(28)22(30)26-17-10-5-8-16-9-6-12-25-20(16)17/h5-6,8-10,12,14-15,18-19,24H,7,11,13H2,1-4H3,(H,26,30)(H,27,29)/t15-,18-,19-/m0/s1
990n/an/an/an/an/an/an/an/a
Sanford-Burnham Medical Research Institute
Curated by ChEMBL
Assay Description
Competitive inhibition of XIAP BIR2 domain by fluorescent polarization assay
Bioorg Med Chem Lett 21: 4332-6 (2011)
Article DOI: 10.1016/j.bmcl.2011.05.049
BindingDB Entry DOI: 10.7270/Q2S46SBD
E3 ubiquitin-protein ligase XIAP
(Homo sapiens (Human))
BDBM44332
(CHEMBL1622564 | MLS-0391025.0001 | cid_44182257 | ...)
Show SMILES CN[C@@H](C)C(=O)N[C@@H](C(C)C)C(=O)N1CCC[C@H]1C(=O)Nc1cccc2cccnc12
Show InChI InChI=1S/C23H31N5O3/c1-14(2)19(27-21(29)15(3)24-4)23(31)28-13-7-11-18(28)22(30)26-17-10-5-8-16-9-6-12-25-20(16)17/h5-6,8-10,12,14-15,18-19,24H,7,11,13H2,1-4H3,(H,26,30)(H,27,29)/t15-,18-,19-/m0/s1
PCBioAssay
n/an/a 2.40E+3n/an/an/an/an/an/a
Burnham Center for Chemical Genomics
Curated by PubChem BioAssay
Assay Description
Data Source: Sanford-Burnham Center for Chemical Genomics (SBCCG) Source Affiliation: Sanford-Burnham Medical Research Institute (SBMRI, San Diego, C...
PubChem Bioassay (2009)
BindingDB Entry DOI: 10.7270/Q2FN14KV
E3 ubiquitin-protein ligase XIAP
(Homo sapiens (Human))
BDBM44332
(CHEMBL1622564 | MLS-0391025.0001 | cid_44182257 | ...)
Show SMILES CN[C@@H](C)C(=O)N[C@@H](C(C)C)C(=O)N1CCC[C@H]1C(=O)Nc1cccc2cccnc12
Show InChI InChI=1S/C23H31N5O3/c1-14(2)19(27-21(29)15(3)24-4)23(31)28-13-7-11-18(28)22(30)26-17-10-5-8-16-9-6-12-25-20(16)17/h5-6,8-10,12,14-15,18-19,24H,7,11,13H2,1-4H3,(H,26,30)(H,27,29)/t15-,18-,19-/m0/s1
PCBioAssay
n/an/a 1.20E+3n/an/an/an/an/an/a
Burnham Center for Chemical Genomics
Curated by PubChem BioAssay
Assay Description
Data Source: Sanford-Burnham Center for Chemical Genomics (SBCCG) Source Affiliation: Sanford-Burnham Medical Research Institute (SBMRI, San Diego, C...
PubChem Bioassay (2009)
BindingDB Entry DOI: 10.7270/Q29W0CWK