null
SMILES: COc1ccc(\C=C\c2cc(o[n+]2C)-c2ccc(C)cc2)cc1
InChI Key: InChIKey=GCMJZTYDJGPOQW-IZZDOVSWSA-N
Activity Spreadsheet -- Enzyme Inhibition Constant Data from BindingDB
Found 4 hits for monomerid = 44553
Trg + Lig
Ki
nM
ΔG°
kcal/mole
IC50
nM
Kd
nM
EC50/IC50
nM
koff
s-1
kon
M-1s-1
pHTemp
°C
Nucleotide-binding oligomerization domain-containing protein 1
(Homo sapiens (Human))
BDBM44553
(3-[(E)-2-(4-methoxyphenyl)ethenyl]-2-methyl-5-(4-m...)
Show SMILES COc1ccc(\C=C\c2cc(o[n+]2C)-c2ccc(C)cc2)cc1
Show InChI InChI=1S/C20H20NO2/c1-15-4-9-17(10-5-15)20-14-18(21(2)23-20)11-6-16-7-12-19(22-3)13-8-16/h4-14H,1-3H3/q+1/b11-6+
Reactome pathway
PCBioAssay
n/an/an/an/a 9.15E+3n/an/an/an/a
Burnham Center for Chemical Genomics
Curated by PubChem BioAssay
Assay Description
Data Source: Sanford-Burnham Center for Chemical Genomics (SBCCG) Source Affiliation: Sanford-Burnham Medical Research Institute (SBMRI, San Diego, C...
PubChem Bioassay (2010)
BindingDB Entry DOI: 10.7270/Q2CN72C0
Tumor necrosis factor
(Homo sapiens (Human))
BDBM44553
(3-[(E)-2-(4-methoxyphenyl)ethenyl]-2-methyl-5-(4-m...)
Show SMILES COc1ccc(\C=C\c2cc(o[n+]2C)-c2ccc(C)cc2)cc1
Show InChI InChI=1S/C20H20NO2/c1-15-4-9-17(10-5-15)20-14-18(21(2)23-20)11-6-16-7-12-19(22-3)13-8-16/h4-14H,1-3H3/q+1/b11-6+
Reactome pathway
PCBioAssay
n/an/a 5.25E+3n/an/an/an/an/an/a
Burnham Center for Chemical Genomics
Curated by PubChem BioAssay
Assay Description
Data Source: Sanford-Burnham Center for Chemical Genomics (SBCCG) Source Affiliation: Sanford-Burnham Medical Research Institute (SBMRI, San Diego, C...
PubChem Bioassay (2010)
BindingDB Entry DOI: 10.7270/Q25M6443
Protein Rev [8-24]
(Human immunodeficiency virus 1)
BDBM44553
(3-[(E)-2-(4-methoxyphenyl)ethenyl]-2-methyl-5-(4-m...)
Show SMILES COc1ccc(\C=C\c2cc(o[n+]2C)-c2ccc(C)cc2)cc1
Show InChI InChI=1S/C20H20NO2/c1-15-4-9-17(10-5-15)20-14-18(21(2)23-20)11-6-16-7-12-19(22-3)13-8-16/h4-14H,1-3H3/q+1/b11-6+
PCBioAssay
n/an/a>7.94E+4n/an/an/an/an/an/a
The Scripps Research Institute Molecular Screening Center
Curated by PubChem BioAssay
Assay Description
Source (MLSCN Center Name): The Scripps Research Institute Molecular Screening Center Center Affiliation: The Scripps Research Institute, TSRI Assay ...
PubChem Bioassay (2007)
BindingDB Entry DOI: 10.7270/Q2DN43GX
Nucleotide-binding oligomerization domain-containing protein 2
(Homo sapiens (Human))
BDBM44553
(3-[(E)-2-(4-methoxyphenyl)ethenyl]-2-methyl-5-(4-m...)
Show SMILES COc1ccc(\C=C\c2cc(o[n+]2C)-c2ccc(C)cc2)cc1
Show InChI InChI=1S/C20H20NO2/c1-15-4-9-17(10-5-15)20-14-18(21(2)23-20)11-6-16-7-12-19(22-3)13-8-16/h4-14H,1-3H3/q+1/b11-6+
Reactome pathway
PCBioAssay
n/an/a 8.34E+3n/an/an/an/an/an/a
Burnham Center for Chemical Genomics
Curated by PubChem BioAssay
Assay Description
Data Source: Sanford-Burnham Center for Chemical Genomics (SBCCG) Source Affiliation: Sanford-Burnham Medical Research Institute (SBMRI, San Diego, C...
PubChem Bioassay (2010)
BindingDB Entry DOI: 10.7270/Q23R0R8T