BDBM4531 4-Phenylamino-3-quinolinecarbonitrile deriv. 1i::4-[(4-Chloro-5-methoxy-2-methylphenyl)amino]-6,7-dimethoxy-3-quinolinecarbonitrile::4-[(4-chloro-5-methoxy-2-methylphenyl)amino]-6,7-dimethoxyquinoline-3-carbonitrile::CHEMBL127331
SMILES: COc1cc(Nc2c(cnc3cc(OC)c(OC)cc23)C#N)c(C)cc1Cl
InChI Key: InChIKey=YAQGBNTVJOCPCH-UHFFFAOYSA-N
Data: 3 IC50
Activity Spreadsheet -- Enzyme Inhibition Constant Data from BindingDB
Found 3 hits for monomerid = 4531
Trg + Lig
Ki
nM
ΔG°
kcal/mole
IC50
nM
Kd
nM
EC50/IC50
nM
koff
s-1
kon
M-1s-1
pHTemp
°C
Proto-oncogene tyrosine-protein kinase Src
(Homo sapiens (Human))
BDBM4531
(4-Phenylamino-3-quinolinecarbonitrile deriv. 1i | ...)
Show SMILES COc1cc(Nc2c(cnc3cc(OC)c(OC)cc23)C#N)c(C)cc1Cl
Show InChI InChI=1S/C20H18ClN3O3/c1-11-5-14(21)17(25-2)7-15(11)24-20-12(9-22)10-23-16-8-19(27-4)18(26-3)6-13(16)20/h5-8,10H,1-4H3,(H,23,24)
n/an/a 4n/an/an/an/a7.530
Wyeth-Ayerst Research
Assay Description
Src kinase activity was measured in an ELISA format. IC50 is the inhibitor concentration which inhibits 50% of kinase activity that catalyzes the tra...
J Med Chem 44: 3965-77 (2001)
Article DOI: 10.1021/jm0102250
BindingDB Entry DOI: 10.7270/Q2TD9VHP
Proto-oncogene tyrosine-protein kinase Src
(Homo sapiens (Human))
BDBM4531
(4-Phenylamino-3-quinolinecarbonitrile deriv. 1i | ...)
Show SMILES COc1cc(Nc2c(cnc3cc(OC)c(OC)cc23)C#N)c(C)cc1Cl
Show InChI InChI=1S/C20H18ClN3O3/c1-11-5-14(21)17(25-2)7-15(11)24-20-12(9-22)10-23-16-8-19(27-4)18(26-3)6-13(16)20/h5-8,10H,1-4H3,(H,23,24)
n/an/a 2.40E+3n/an/an/an/an/an/a
Wyeth-Ayerst Research
Curated by ChEMBL
Assay Description
Inhibition of EGFR overexpressing A431 cell proliferation
Bioorg Med Chem Lett 12: 423-5 (2002)
BindingDB Entry DOI: 10.7270/Q2WM1CQ7
Proto-oncogene tyrosine-protein kinase Src
(Homo sapiens (Human))
BDBM4531
(4-Phenylamino-3-quinolinecarbonitrile deriv. 1i | ...)
Show SMILES COc1cc(Nc2c(cnc3cc(OC)c(OC)cc23)C#N)c(C)cc1Cl
Show InChI InChI=1S/C20H18ClN3O3/c1-11-5-14(21)17(25-2)7-15(11)24-20-12(9-22)10-23-16-8-19(27-4)18(26-3)6-13(16)20/h5-8,10H,1-4H3,(H,23,24)
n/an/a 4n/an/an/an/an/an/a
Wyeth-Ayerst Research
Curated by ChEMBL
Assay Description
Inhibition of Src protein tryrosine kinase
Bioorg Med Chem Lett 12: 423-5 (2002)
BindingDB Entry DOI: 10.7270/Q2WM1CQ7