BDBM45362 2,3-dimethoxybenzoic acid (5-amino-1-tosyl-pyrazol-3-yl) ester::2,3-dimethoxybenzoic acid [5-amino-1-(4-methylphenyl)sulfonyl-3-pyrazolyl] ester::5-amino-1-[(4-methylphenyl)sulfonyl]-1H-pyrazol-3-yl 2,3-dimethoxybenzoate::MLS000090440::SMR000025050::[5-amino-1-(4-methylphenyl)sulfonylpyrazol-3-yl] 2,3-dimethoxybenzoate::[5-azanyl-1-(4-methylphenyl)sulfonyl-pyrazol-3-yl] 2,3-dimethoxybenzoate::cid_3236830
SMILES: COc1cccc(C(=O)Oc2cc(N)n(n2)S(=O)(=O)c2ccc(C)cc2)c1OC
InChI Key: InChIKey=GZUGWGQRRGTKKN-UHFFFAOYSA-N
Data: 2 IC50
Activity Spreadsheet -- Enzyme Inhibition Constant Data from BindingDB
Found 2 hits for monomerid = 45362
Trg + Lig
Ki
nM
ΔG°
kcal/mole
IC50
nM
Kd
nM
EC50/IC50
nM
koff
s-1
kon
M-1s-1
pHTemp
°C
Kallikrein 5
(Homo sapiens (Human))
BDBM45362
(2,3-dimethoxybenzoic acid (5-amino-1-tosyl-pyrazol...)
Show SMILES COc1cccc(C(=O)Oc2cc(N)n(n2)S(=O)(=O)c2ccc(C)cc2)c1OC
Show InChI InChI=1S/C19H19N3O6S/c1-12-7-9-13(10-8-12)29(24,25)22-16(20)11-17(21-22)28-19(23)14-5-4-6-15(26-2)18(14)27-3/h4-11H,20H2,1-3H3
PCBioAssay
n/an/a 1.69E+3n/an/an/an/an/an/a
PCMD
Curated by PubChem BioAssay
Assay Description
Molecular Library Screening Center Network (MLSCN) Penn Center for Molecular Discovery (PCMD) Assay Provider: Scott L. Diamond, University of Pennsy...
PubChem Bioassay (2008)
BindingDB Entry DOI: 10.7270/Q2GH9GC8
Factor XIIa
(Homo sapiens (Human))
BDBM45362
(2,3-dimethoxybenzoic acid (5-amino-1-tosyl-pyrazol...)
Show SMILES COc1cccc(C(=O)Oc2cc(N)n(n2)S(=O)(=O)c2ccc(C)cc2)c1OC
Show InChI InChI=1S/C19H19N3O6S/c1-12-7-9-13(10-8-12)29(24,25)22-16(20)11-17(21-22)28-19(23)14-5-4-6-15(26-2)18(14)27-3/h4-11H,20H2,1-3H3
PCBioAssay
n/an/a 3.40E+4n/an/an/an/an/an/a
PCMD
Curated by PubChem BioAssay
Assay Description
Molecular Library Screening Center Network (MLSCN) Penn Center for Molecular Discovery (PCMD) Assay Provider: Scott L. Diamond, University of Pennsy...
PubChem Bioassay (2008)
BindingDB Entry DOI: 10.7270/Q21G0JQS