null
SMILES: Oc1ccccc1C=NNC(=O)CCCOc1ccc(Cl)cc1Cl
InChI Key: InChIKey=INTXPLVFGPOGKD-UHFFFAOYSA-N
Activity Spreadsheet -- Enzyme Inhibition Constant Data from BindingDB
Found 2 hits for monomerid = 4541
Trg + Lig
Ki
nM
ΔG°
kcal/mole
IC50
nM
Kd
nM
EC50/IC50
nM
koff
s-1
kon
M-1s-1
pHTemp
°C
Nuclear receptor coactivator 1
(Homo sapiens (Human))
BDBM4541
(cid_5897172)
Show SMILES Oc1ccccc1C=NNC(=O)CCCOc1ccc(Cl)cc1Cl |w:8.9|
Show InChI InChI=1S/C17H16Cl2N2O3/c18-13-7-8-16(14(19)10-13)24-9-3-6-17(23)21-20-11-12-4-1-2-5-15(12)22/h1-2,4-5,7-8,10-11,22H,3,6,9H2,(H,21,23)
Reactome pathway
PCBioAssay
n/an/a 6.73E+3n/an/an/an/an/an/a
The Scripps Research Institute Molecular Screening Center
Curated by PubChem BioAssay
Assay Description
Source (MLPCN Center Name): The Scripps Research Institute Molecular Screening Center (SRIMSC) Affiliation: The Scripps Research Institute, TSRI Assa...
PubChem Bioassay (2012)
BindingDB Entry DOI: 10.7270/Q2794387
Nuclear receptor coactivator 3
(Homo sapiens (Human))
BDBM4541
(cid_5897172)
Show SMILES Oc1ccccc1C=NNC(=O)CCCOc1ccc(Cl)cc1Cl |w:8.9|
Show InChI InChI=1S/C17H16Cl2N2O3/c18-13-7-8-16(14(19)10-13)24-9-3-6-17(23)21-20-11-12-4-1-2-5-15(12)22/h1-2,4-5,7-8,10-11,22H,3,6,9H2,(H,21,23)
Reactome pathway
PCBioAssay
n/an/a 6.32E+3n/an/an/an/an/an/a
The Scripps Research Institute Molecular Screening Center
Curated by PubChem BioAssay
Assay Description
Source (MLPCN Center Name): The Scripps Research Institute Molecular Screening Center (SRIMSC) Affiliation: The Scripps Research Institute, TSRI Assa...
PubChem Bioassay (2012)
BindingDB Entry DOI: 10.7270/Q2C24V0K